{"text_format":"2","workbook":"xlsx","n_sheets":4,"sheets":["분할상환계획표","ZCO_BZDD","상환일","상환금"],"not_rendered":{"charts":0,"images":0,"macros":0,"external_links":0,"defined_names":0,"comments":0,"pivot_tables":0},"unopened":[],"bounds":{"document_bytes":16777216,"sheet_cells":100000,"run_cost":"one","rows_first":2000,"rows_last":500,"rows_between":2000,"halvings":0,"cell_chars":16384,"cell_head_chars":4096},"cells_cut":0,"cells_raw":0,"read":"whole","date_system":"1900"}

{"sheet":"분할상환계획표","index":0,"n_rows":23,"n_cols":8,"rows_kept":23,"cut":false,"hidden":false,"merged":[[17,5,17,6],[13,5,13,6],[13,7,13,8],[15,5,15,6],[15,7,15,8],[16,5,16,6],[16,7,16,8],[22,1,22,8],[21,1,21,8],[18,5,18,6],[18,7,18,8],[19,1,19,6],[19,7,19,8],[20,1,20,6],[17,7,17,8],[1,1,1,8],[6,1,6,3],[6,4,6,8],[3,1,4,3],[3,4,4,5],[3,6,4,6],[3,7,4,8],[8,1,8,3],[8,4,8,8],[10,1,10,3],[10,4,10,8],[14,5,14,6],[14,7,14,8],[12,5,12,6],[12,7,12,8]]}
[]
[null,"기본운영자금 한도초과금액 분할상환 계획표"]
[]
[null,"기본운영자금 거래번호",null,null,2024,null,"-",12345]
[]
[]
[null,"기본운영자금 한도초과금액\n(분할상환 신청금액)",null,null,0]
[]
[null,"분할상환 승인일",null,null,"2025-04-08"]
[]
[null,"분할상환 승인회차",null,null,12]
[]
[null,"회차","분할상환일","분할상환금액","회차","분할상환일",null,"분할상환금액"]
[null,1,{"$f":"상환일!B18","v":"2025-05-08"},{"$f":"상환금!B6","v":0},7,{"$f":"상환일!B24","v":"2025-11-10"},null,{"$f":"상환금!B12","v":0}]
[null,2,{"$f":"상환일!B19","v":"2025-06-09"},{"$f":"상환금!B7","v":0},8,{"$f":"상환일!B25","v":"2025-12-08"},null,{"$f":"상환금!B13","v":0}]
[null,3,{"$f":"상환일!B20","v":"2025-07-08"},{"$f":"상환금!B8","v":0},9,{"$f":"상환일!B26","v":"2026-01-08"},null,{"$f":"상환금!B14","v":0}]
[null,4,{"$f":"상환일!B21","v":"2025-08-08"},{"$f":"상환금!B9","v":0},10,{"$f":"상환일!B27","v":"2026-02-09"},null,{"$f":"상환금!B15","v":0}]
[null,5,{"$f":"상환일!B22","v":"2025-09-08"},{"$f":"상환금!B10","v":0},11,{"$f":"상환일!B28","v":"2026-03-09"},null,{"$f":"상환금!B16","v":0}]
[null,6,{"$f":"상환일!B23","v":"2025-10-10"},{"$f":"상환금!B11","v":0},12,{"$f":"상환일!B29","v":"2026-04-07"},null,{"$f":"상환금!B17","v":0}]
[null,"분할상환금액 합계",{"$nulls":5},{"$f":"SUM($D$14:$D$19,$H$14:$I$19)","v":0}]
[]
[null,"(입력사항) \n  1. 기본운영자금 거래번호를 입력합니다. (모르시는 경우 영업점에 문의 바랍니다.)\n  2. \"기본운영자금 한도초과금액\"란에 분할상환 승인받을 기본운영자금 한도초과금액을 \n      입력하시면 매월 납부하실 분할상환금액이 자동 계산됩니다. \n  3. 분할상환 승인일과 승인회차를 입력합니다. 분할상환일은 분할상환 승인일 이후 12개월간, \n     매월의 분할상환승인일과 같은 날짜로 자동 입력됩니다.(해당일이 휴일인경우 다음 영업일\n     이며, 최종회차 분할상환일은 한도내 금액의 연장 상환기한과 동일함) \n\n※ 분할상환일 사례\n당초 1억원의 기본운영자금 상환기한이 ‘22. 12. 7.(수)이고, 한도내 금액인 8천만원의 연장 상환기한이 '23. 12. 6.(수)이며, 한도초과로 2천만원을 ’22. 12. 7.(수)에 분할상환 승인받을 경우, 1회차 분할상환일은 분할상환 승인일 한 달 뒤인 ‘23. 1. 7.(토)이나 해당일이 휴일이므로, ’23. 1. 9.(월)이 분할상환일이 되고, 2회차 분할상환일은 ‘23. 2. 7.(화)이 되는 등 매월 7일자로 납부하여야 함. 다만, 마지막 12회차 분할상환일은 한도내 금액의 연장 상환기한인 '23. 12. 6.(수)이 됨."]
[null,"(분할상환금액 및 이자금액)*\n 1. 분할상환일 : 분할상환 승인 기간(분할상환 승인일 이후 12개월) 동안 분할상환 \n    승인일과 매월 같은 날짜(해당일이 휴일인 경우 다음 영업일이며, 최종회차 분할상환일\n    은 한도내 금액의 연장 상환기한과 동일함)\n 2. 매월 납부할 분할상환금액 : 분할상환 승인 기본운영자금 한도초과금액 ÷ 12회\n    (10원미만 절사하고, 절사금액 합은 최종 12회차에 납부)\n 3. 회차별 이자금액 : 분할상환 승인 기본융자 한도초과잔액 × 이자율 × 회차별 일수/365\n 4. 각 분할상환일에 이자를 납부해야하며, 조합 홈페이지 인터넷창구 “조회>>\n    융자조회>>융자금이자산출” 화면에서 이자금액 조회 가능\n* 해당 안내문은 정상적인 분할상환 신청을 전제로 하며, 그 밖의 자세한 사항은 관할 영업점에 문의"]

{"sheet":"ZCO_BZDD","index":1,"n_rows":645,"n_cols":6,"rows_kept":645,"cut":false,"hidden":true,"merged":[]}
["BZDA",null,"SALS_YM","BZDD_YN","LAST_CHNG_DTTM","LAST_CHNR_ID"]
[20240630,{"$f":"DATE(LEFT(A2,4),MID(A2,5,2),RIGHT(A2,2))","v":"2024-06-30"},202406,"N","2021/06/04 오후 13:42:17.102000",2008005]
[20240706,{"$f":"DATE(LEFT(A3,4),MID(A3,5,2),RIGHT(A3,2))","v":"2024-07-06"},202407,"N","2021/06/04 오후 13:42:17.102000",2008005]
[20240707,"2024-07-07",202407,"N","2021/06/04 오후 13:42:17.102000",2008005]
[20240713,"2024-07-13",202407,"N","2021/06/04 오후 13:42:17.102000",2008005]
[20240714,"2024-07-14",202407,"N","2021/06/04 오후 13:42:17.102000",2008005]
[20240720,"2024-07-20",202407,"N","2021/06/04 오후 13:42:17.102000",2008005]
[20240721,"2024-07-21",202407,"N","2021/06/04 오후 13:42:17.102000",2008005]
[20240727,"2024-07-27",202407,"N","2021/06/04 오후 13:42:17.102000",2008005]
[20240728,"2024-07-28",202407,"N","2021/06/04 오후 13:42:17.102000",2008005]
[20240803,"2024-08-03",202408,"N","2021/06/04 오후 13:42:17.102000",2008005]
[20240804,"2024-08-04",202408,"N","2021/06/04 오후 13:42:17.102000",2008005]
[20240810,"2024-08-10",202408,"N","2021/06/04 오후 13:42:17.102000",2008005]
[20240811,"2024-08-11",202408,"N","2021/06/04 오후 13:42:17.102000",2008005]
[20240815,"2024-08-15",202408,"N","2021/06/04 오후 13:42:17.102000",2008005]
[20240817,"2024-08-17",202408,"N","2021/06/04 오후 13:42:17.102000",2008005]
[20240818,"2024-08-18",202408,"N","2021/06/04 오후 13:42:17.102000",2008005]
[20240824,"2024-08-24",202408,"N","2021/06/04 오후 13:42:17.102000",2008005]
[20240825,"2024-08-25",202408,"N","2021/06/04 오후 13:42:17.102000",2008005]
[20240831,"2024-08-31",202408,"N","2021/06/04 오후 13:42:17.102000",2008005]
[20240901,"2024-09-01",202409,"N","2021/06/04 오후 13:42:17.102000",2008005]
[20240907,"2024-09-07",202409,"N","2021/06/04 오후 13:42:17.102000",2008005]
[20240908,"2024-09-08",202409,"N","2021/06/04 오후 13:42:17.102000",2008005]
[20240914,"2024-09-14",202409,"N","2021/06/04 오후 13:42:17.102000",2008005]
[20240915,"2024-09-15",202409,"N","2021/06/04 오후 13:42:17.102000",2008005]
[20240916,"2024-09-16",202409,"N","2021/06/04 오후 13:42:17.102000",2008005]
[20240917,"2024-09-17",202409,"N","2021/06/04 오후 13:42:17.102000",2008005]
[20240918,"2024-09-18",202409,"N","2021/06/04 오후 13:42:17.102000",2008005]
[20240921,"2024-09-21",202409,"N","2021/06/04 오후 13:42:17.102000",2008005]
[20240922,"2024-09-22",202409,"N","2021/06/04 오후 13:42:17.102000",2008005]
[20240928,"2024-09-28",202409,"N","2021/06/04 오후 13:42:17.102000",2008005]
[20240929,"2024-09-29",202409,"N","2021/06/04 오후 13:42:17.102000",2008005]
[20241003,"2024-10-03",202410,"N","2021/06/04 오후 13:42:17.102000",2008005]
[20241005,"2024-10-05",202410,"N","2021/06/04 오후 13:42:17.102000",2008005]
[20241006,"2024-10-06",202410,"N","2021/06/04 오후 13:42:17.102000",2008005]
[20241009,"2024-10-09",202410,"N","2021/06/04 오후 13:42:17.102000",2008005]
[20241012,"2024-10-12",202410,"N","2021/06/04 오후 13:42:17.102000",2008005]
[20241013,"2024-10-13",202410,"N","2021/06/04 오후 13:42:17.102000",2008005]
[20241019,"2024-10-19",202410,"N","2021/06/04 오후 13:42:17.102000",2008005]
[20241020,"2024-10-20",202410,"N","2021/06/04 오후 13:42:17.102000",2008005]
[20241026,"2024-10-26",202410,"N","2021/06/04 오후 13:42:17.102000",2008005]
[20241027,"2024-10-27",202410,"N","2021/06/04 오후 13:42:17.102000",2008005]
[20241102,"2024-11-02",202411,"N","2021/06/04 오후 13:42:17.102000",2008005]
[20241103,"2024-11-03",202411,"N","2021/06/04 오후 13:42:17.102000",2008005]
[20241109,"2024-11-09",202411,"N","2021/06/04 오후 13:42:17.102000",2008005]
[20241110,"2024-11-10",202411,"N","2021/06/04 오후 13:42:17.102000",2008005]
[20241116,"2024-11-16",202411,"N","2021/06/04 오후 13:42:17.102000",2008005]
[20241117,"2024-11-17",202411,"N","2021/06/04 오후 13:42:17.102000",2008005]
[20241123,"2024-11-23",202411,"N","2021/06/04 오후 13:42:17.102000",2008005]
[20241124,"2024-11-24",202411,"N","2021/06/04 오후 13:42:17.102000",2008005]
[20241130,"2024-11-30",202411,"N","2021/06/04 오후 13:42:17.102000",2008005]
[20241201,"2024-12-01",202412,"N","2021/06/04 오후 13:42:17.102000",2008005]
[20241207,"2024-12-07",202412,"N","2021/06/04 오후 13:42:17.102000",2008005]
[20241208,"2024-12-08",202412,"N","2021/06/04 오후 13:42:17.102000",2008005]
[20241214,"2024-12-14",202412,"N","2021/06/04 오후 13:42:17.102000",2008005]
[20241215,"2024-12-15",202412,"N","2021/06/04 오후 13:42:17.102000",2008005]
[20241221,"2024-12-21",202412,"N","2021/06/04 오후 13:42:17.102000",2008005]
[20241222,"2024-12-22",202412,"N","2021/06/04 오후 13:42:17.102000",2008005]
[20241225,"2024-12-25",202412,"N","2021/06/04 오후 13:42:17.102000",2008005]
[20241228,"2024-12-28",202412,"N","2021/06/04 오후 13:42:17.102000",2008005]
[20241229,"2024-12-29",202412,"N","2021/06/04 오후 13:42:17.102000",2008005]
[20250101,"2025-01-01",202501,"N","2021/06/04 오후 14:10:48.430000",2008005]
[20250104,"2025-01-04",202501,"N","2021/06/04 오후 14:10:48.430000",2008005]
[20250105,"2025-01-05",202501,"N","2021/06/04 오후 14:10:48.430000",2008005]
[20250111,"2025-01-11",202501,"N","2021/06/04 오후 14:10:48.430000",2008005]
[20250112,"2025-01-12",202501,"N","2021/06/04 오후 14:10:48.430000",2008005]
[20250118,{"$f":"DATE(LEFT(A67,4),MID(A67,5,2),RIGHT(A67,2))","v":"2025-01-18"},202501,"N","2021/06/04 오후 14:10:48.430000",2008005]
[20250119,"2025-01-19",202501,"N","2021/06/04 오후 14:10:48.430000",2008005]
[20250125,"2025-01-25",202501,"N","2021/06/04 오후 14:10:48.430000",2008005]
[20250126,"2025-01-26",202501,"N","2021/06/04 오후 14:10:48.430000",2008005]
[20250128,"2025-01-28",202501,"N","2021/06/04 오후 14:10:48.430000",2008005]
[20250129,"2025-01-29",202501,"N","2021/06/04 오후 14:10:48.430000",2008005]
[20250130,"2025-01-30",202501,"N","2021/06/04 오후 14:10:48.430000",2008005]
[20250201,"2025-02-01",202502,"N","2021/06/04 오후 13:42:18.833000",2008005]
[20250202,"2025-02-02",202502,"N","2021/06/04 오후 13:42:18.833000",2008005]
[20250208,"2025-02-08",202502,"N","2021/06/04 오후 13:42:18.833000",2008005]
[20250209,"2025-02-09",202502,"N","2021/06/04 오후 13:42:18.833000",2008005]
[20250215,"2025-02-15",202502,"N","2021/06/04 오후 13:42:18.833000",2008005]
[20250216,"2025-02-16",202502,"N","2021/06/04 오후 13:42:18.833000",2008005]
[20250222,"2025-02-22",202502,"N","2021/06/04 오후 13:42:18.833000",2008005]
[20250223,"2025-02-23",202502,"N","2021/06/04 오후 13:42:18.833000",2008005]
[20250301,"2025-03-01",202503,"N","2024/07/02 오전 9:14:08.468000",2007006]
[20250302,"2025-03-02",202503,"N","2024/07/02 오전 9:14:08.468000",2007006]
[20250303,"2025-03-03",202503,"N","2024/07/02 오전 9:14:08.468000",2007006]
[20250308,"2025-03-08",202503,"N","2024/07/02 오전 9:14:08.468000",2007006]
[20250309,"2025-03-09",202503,"N","2024/07/02 오전 9:14:08.468000",2007006]
[20250315,"2025-03-15",202503,"N","2024/07/02 오전 9:14:08.468000",2007006]
[20250316,"2025-03-16",202503,"N","2024/07/02 오전 9:14:08.468000",2007006]
[20250322,"2025-03-22",202503,"N","2024/07/02 오전 9:14:08.468000",2007006]
[20250323,"2025-03-23",202503,"N","2024/07/02 오전 9:14:08.468000",2007006]
[20250329,"2025-03-29",202503,"N","2024/07/02 오전 9:14:08.468000",2007006]
[20250330,"2025-03-30",202503,"N","2024/07/02 오전 9:14:08.468000",2007006]
[20250405,"2025-04-05",202504,"N","2021/06/04 오후 13:42:18.833000",2008005]
[20250406,"2025-04-06",202504,"N","2021/06/04 오후 13:42:18.833000",2008005]
[20250412,"2025-04-12",202504,"N","2021/06/04 오후 13:42:18.833000",2008005]
[20250413,"2025-04-13",202504,"N","2021/06/04 오후 13:42:18.833000",2008005]
[20250419,"2025-04-19",202504,"N","2021/06/04 오후 13:42:18.833000",2008005]
[20250420,"2025-04-20",202504,"N","2021/06/04 오후 13:42:18.833000",2008005]
[20250426,"2025-04-26",202504,"N","2021/06/04 오후 13:42:18.833000",2008005]
[20250427,"2025-04-27",202504,"N","2021/06/04 오후 13:42:18.833000",2008005]
[20250501,"2025-05-01",202505,"N","2024/07/02 오후 14:19:15.927000",2003029]
[20250503,"2025-05-03",202505,"N","2024/07/02 오후 14:19:15.927000",2003029]
[20250504,"2025-05-04",202505,"N","2024/07/02 오후 14:19:15.927000",2003029]
[20250505,"2025-05-05",202505,"N","2024/07/02 오후 14:19:15.927000",2003029]
[20250506,"2025-05-06",202505,"N","2024/07/02 오후 14:19:15.927000",2003029]
[20250510,"2025-05-10",202505,"N","2024/07/02 오후 14:19:15.927000",2003029]
[20250511,"2025-05-11",202505,"N","2024/07/02 오후 14:19:15.927000",2003029]
[20250517,"2025-05-17",202505,"N","2024/07/02 오후 14:19:15.927000",2003029]
[20250518,"2025-05-18",202505,"N","2024/07/02 오후 14:19:15.927000",2003029]
[20250524,"2025-05-24",202505,"N","2024/07/02 오후 14:19:15.927000",2003029]
[20250525,"2025-05-25",202505,"N","2024/07/02 오후 14:19:15.927000",2003029]
[20250531,"2025-05-31",202505,"N","2024/07/02 오후 14:19:15.927000",2003029]
[20250601,"2025-06-01",202506,"N","2021/06/04 오후 13:42:18.833000",2008005]
[20250603,{"$f":"DATE(LEFT(A114,4),MID(A114,5,2),RIGHT(A114,2))","v":"2025-06-03"},202506,"N","2021/06/04 오후 13:42:18.833000",2008005]
[20250606,"2025-06-06",202506,"N","2021/06/04 오후 13:42:18.833000",2008005]
[20250607,"2025-06-07",202506,"N","2021/06/04 오후 13:42:18.833000",2008005]
[20250608,"2025-06-08",202506,"N","2021/06/04 오후 13:42:18.833000",2008005]
[20250614,"2025-06-14",202506,"N","2021/06/04 오후 13:42:18.833000",2008005]
[20250615,"2025-06-15",202506,"N","2021/06/04 오후 13:42:18.833000",2008005]
[20250621,"2025-06-21",202506,"N","2021/06/04 오후 13:42:18.833000",2008005]
{"$rows_left_out":526}
{"sheet":"상환일","index":2,"n_rows":29,"n_cols":21,"rows_kept":29,"cut":false,"hidden":true,"merged":[]}
[]
["승인일",{"$f":"분할상환계획표!E9","v":"2025-04-08"}]
[null,1,null,2,null,3,null,4,null,5,null,6,null,7,null,8,null,9,null,10]
[1,{"$f":"EDATE($B$2,1)","v":"2025-05-08"},{"$f":"IFERROR(VLOOKUP(B4,ZCO_BZDD!$B:$D,3,),\"Y\")","v":"Y"},{"$f":"IF(C4=\"Y\",\"\",B4+1)","v":""},{"$f":"IF(D4=\"\",\"\",IFERROR(VLOOKUP(D4,ZCO_BZDD!$B$2:$D$645,3,),\"Y\"))","v":""},{"$f":"IFERROR(IF(E4=\"Y\",\"\",D4+1),\"\")","v":""},{"$f":"IF(F4=\"\",\"\",IFERROR(VLOOKUP(F4,ZCO_BZDD!$B$2:$D$645,3,),\"Y\"))","v":""},{"$f":"IFERROR(IF(G4=\"Y\",\"\",F4+1),\"\")","v":""},{"$f":"IF(H4=\"\",\"\",IFERROR(VLOOKUP(H4,ZCO_BZDD!$B$2:$D$645,3,),\"Y\"))","v":""},{"$f":"IFERROR(IF(I4=\"Y\",\"\",H4+1),\"\")","v":""},{"$f":"IF(J4=\"\",\"\",IFERROR(VLOOKUP(J4,ZCO_BZDD!$B$2:$D$645,3,),\"Y\"))","v":""},{"$f":"IFERROR(IF(K4=\"Y\",\"\",J4+1),\"\")","v":""},{"$f":"IF(L4=\"\",\"\",IFERROR(VLOOKUP(L4,ZCO_BZDD!$B$2:$D$645,3,),\"Y\"))","v":""},{"$f":"IFERROR(IF(M4=\"Y\",\"\",L4+1),\"\")","v":""},{"$f":"IF(N4=\"\",\"\",IFERROR(VLOOKUP(N4,ZCO_BZDD!$B$2:$D$645,3,),\"Y\"))","v":""},{"$f":"IFERROR(IF(O4=\"Y\",\"\",N4+1),\"\")","v":""},{"$f":"IF(P4=\"\",\"\",IFERROR(VLOOKUP(P4,ZCO_BZDD!$B$2:$D$645,3,),\"Y\"))","v":""},{"$f":"IFERROR(IF(Q4=\"Y\",\"\",P4+1),\"\")","v":""},{"$f":"IF(R4=\"\",\"\",IFERROR(VLOOKUP(R4,ZCO_BZDD!$B$2:$D$645,3,),\"Y\"))","v":""},{"$f":"IFERROR(IF(S4=\"Y\",\"\",R4+1),\"\")","v":""},{"$f":"IF(T4=\"\",\"\",IFERROR(VLOOKUP(T4,ZCO_BZDD!$B$2:$D$645,3,),\"Y\"))","v":""}]
[2,{"$f":"EDATE($B$2,2)","v":"2025-06-08"},{"$f":"IFERROR(VLOOKUP(B5,ZCO_BZDD!$B:$D,3,),\"Y\")","v":"N"},{"$f":"IF(C5=\"Y\",\"\",B5+1)","v":"2025-06-09"},{"$f":"IF(D5=\"\",\"\",IFERROR(VLOOKUP(D5,ZCO_BZDD!$B$2:$D$645,3,),\"Y\"))","v":"Y"},{"$f":"IFERROR(IF(E5=\"Y\",\"\",D5+1),\"\")","v":""},{"$f":"IF(F5=\"\",\"\",IFERROR(VLOOKUP(F5,ZCO_BZDD!$B$2:$D$645,3,),\"Y\"))","v":""},{"$f":"IFERROR(IF(G5=\"Y\",\"\",F5+1),\"\")","v":""},{"$f":"IF(H5=\"\",\"\",IFERROR(VLOOKUP(H5,ZCO_BZDD!$B$2:$D$645,3,),\"Y\"))","v":""},{"$f":"IFERROR(IF(I5=\"Y\",\"\",H5+1),\"\")","v":""},{"$f":"IF(J5=\"\",\"\",IFERROR(VLOOKUP(J5,ZCO_BZDD!$B$2:$D$645,3,),\"Y\"))","v":""},{"$f":"IFERROR(IF(K5=\"Y\",\"\",J5+1),\"\")","v":""},{"$f":"IF(L5=\"\",\"\",IFERROR(VLOOKUP(L5,ZCO_BZDD!$B$2:$D$645,3,),\"Y\"))","v":""},{"$f":"IFERROR(IF(M5=\"Y\",\"\",L5+1),\"\")","v":""},{"$f":"IF(N5=\"\",\"\",IFERROR(VLOOKUP(N5,ZCO_BZDD!$B$2:$D$645,3,),\"Y\"))","v":""},{"$f":"IFERROR(IF(O5=\"Y\",\"\",N5+1),\"\")","v":""},{"$f":"IF(P5=\"\",\"\",IFERROR(VLOOKUP(P5,ZCO_BZDD!$B$2:$D$645,3,),\"Y\"))","v":""},{"$f":"IFERROR(IF(Q5=\"Y\",\"\",P5+1),\"\")","v":""},{"$f":"IF(R5=\"\",\"\",IFERROR(VLOOKUP(R5,ZCO_BZDD!$B$2:$D$645,3,),\"Y\"))","v":""},{"$f":"IFERROR(IF(S5=\"Y\",\"\",R5+1),\"\")","v":""},{"$f":"IF(T5=\"\",\"\",IFERROR(VLOOKUP(T5,ZCO_BZDD!$B$2:$D$645,3,),\"Y\"))","v":""}]
[3,{"$f":"EDATE($B$2,3)","v":"2025-07-08"},{"$f":"IFERROR(VLOOKUP(B6,ZCO_BZDD!$B:$D,3,),\"Y\")","v":"Y"},{"$f":"IF(C6=\"Y\",\"\",B6+1)","v":""},{"$f":"IF(D6=\"\",\"\",IFERROR(VLOOKUP(D6,ZCO_BZDD!$B$2:$D$645,3,),\"Y\"))","v":""},"",{"$f":"IF(F6=\"\",\"\",IFERROR(VLOOKUP(F6,ZCO_BZDD!$B$2:$D$645,3,),\"Y\"))","v":""},"",{"$f":"IF(H6=\"\",\"\",IFERROR(VLOOKUP(H6,ZCO_BZDD!$B$2:$D$645,3,),\"Y\"))","v":""},"",{"$f":"IF(J6=\"\",\"\",IFERROR(VLOOKUP(J6,ZCO_BZDD!$B$2:$D$645,3,),\"Y\"))","v":""},"",{"$f":"IF(L6=\"\",\"\",IFERROR(VLOOKUP(L6,ZCO_BZDD!$B$2:$D$645,3,),\"Y\"))","v":""},"",{"$f":"IF(N6=\"\",\"\",IFERROR(VLOOKUP(N6,ZCO_BZDD!$B$2:$D$645,3,),\"Y\"))","v":""},"",{"$f":"IF(P6=\"\",\"\",IFERROR(VLOOKUP(P6,ZCO_BZDD!$B$2:$D$645,3,),\"Y\"))","v":""},"",{"$f":"IF(R6=\"\",\"\",IFERROR(VLOOKUP(R6,ZCO_BZDD!$B$2:$D$645,3,),\"Y\"))","v":""},"",{"$f":"IF(T6=\"\",\"\",IFERROR(VLOOKUP(T6,ZCO_BZDD!$B$2:$D$645,3,),\"Y\"))","v":""}]
[4,{"$f":"EDATE($B$2,4)","v":"2025-08-08"},{"$f":"IFERROR(VLOOKUP(B7,ZCO_BZDD!$B:$D,3,),\"Y\")","v":"Y"},{"$f":"IF(C7=\"Y\",\"\",B7+1)","v":""},{"$f":"IF(D7=\"\",\"\",IFERROR(VLOOKUP(D7,ZCO_BZDD!$B$2:$D$645,3,),\"Y\"))","v":""},"",{"$f":"IF(F7=\"\",\"\",IFERROR(VLOOKUP(F7,ZCO_BZDD!$B$2:$D$645,3,),\"Y\"))","v":""},"",{"$f":"IF(H7=\"\",\"\",IFERROR(VLOOKUP(H7,ZCO_BZDD!$B$2:$D$645,3,),\"Y\"))","v":""},"",{"$f":"IF(J7=\"\",\"\",IFERROR(VLOOKUP(J7,ZCO_BZDD!$B$2:$D$645,3,),\"Y\"))","v":""},"",{"$f":"IF(L7=\"\",\"\",IFERROR(VLOOKUP(L7,ZCO_BZDD!$B$2:$D$645,3,),\"Y\"))","v":""},"",{"$f":"IF(N7=\"\",\"\",IFERROR(VLOOKUP(N7,ZCO_BZDD!$B$2:$D$645,3,),\"Y\"))","v":""},"",{"$f":"IF(P7=\"\",\"\",IFERROR(VLOOKUP(P7,ZCO_BZDD!$B$2:$D$645,3,),\"Y\"))","v":""},"",{"$f":"IF(R7=\"\",\"\",IFERROR(VLOOKUP(R7,ZCO_BZDD!$B$2:$D$645,3,),\"Y\"))","v":""},"",{"$f":"IF(T7=\"\",\"\",IFERROR(VLOOKUP(T7,ZCO_BZDD!$B$2:$D$645,3,),\"Y\"))","v":""}]
[5,{"$f":"EDATE($B$2,5)","v":"2025-09-08"},{"$f":"IFERROR(VLOOKUP(B8,ZCO_BZDD!$B:$D,3,),\"Y\")","v":"Y"},"",{"$f":"IF(D8=\"\",\"\",IFERROR(VLOOKUP(D8,ZCO_BZDD!$B$2:$D$645,3,),\"Y\"))","v":""},"",{"$f":"IF(F8=\"\",\"\",IFERROR(VLOOKUP(F8,ZCO_BZDD!$B$2:$D$645,3,),\"Y\"))","v":""},"",{"$f":"IF(H8=\"\",\"\",IFERROR(VLOOKUP(H8,ZCO_BZDD!$B$2:$D$645,3,),\"Y\"))","v":""},"",{"$f":"IF(J8=\"\",\"\",IFERROR(VLOOKUP(J8,ZCO_BZDD!$B$2:$D$645,3,),\"Y\"))","v":""},"",{"$f":"IF(L8=\"\",\"\",IFERROR(VLOOKUP(L8,ZCO_BZDD!$B$2:$D$645,3,),\"Y\"))","v":""},"",{"$f":"IF(N8=\"\",\"\",IFERROR(VLOOKUP(N8,ZCO_BZDD!$B$2:$D$645,3,),\"Y\"))","v":""},"",{"$f":"IF(P8=\"\",\"\",IFERROR(VLOOKUP(P8,ZCO_BZDD!$B$2:$D$645,3,),\"Y\"))","v":""},"",{"$f":"IF(R8=\"\",\"\",IFERROR(VLOOKUP(R8,ZCO_BZDD!$B$2:$D$645,3,),\"Y\"))","v":""},"",{"$f":"IF(T8=\"\",\"\",IFERROR(VLOOKUP(T8,ZCO_BZDD!$B$2:$D$645,3,),\"Y\"))","v":""}]
[6,{"$f":"EDATE($B$2,6)","v":"2025-10-08"},{"$f":"IFERROR(VLOOKUP(B9,ZCO_BZDD!$B:$D,3,),\"Y\")","v":"N"},"2025-10-09",{"$f":"IF(D9=\"\",\"\",IFERROR(VLOOKUP(D9,ZCO_BZDD!$B$2:$D$645,3,),\"Y\"))","v":"N"},"2025-10-10",{"$f":"IF(F9=\"\",\"\",IFERROR(VLOOKUP(F9,ZCO_BZDD!$B$2:$D$645,3,),\"Y\"))","v":"Y"},"",{"$f":"IF(H9=\"\",\"\",IFERROR(VLOOKUP(H9,ZCO_BZDD!$B$2:$D$645,3,),\"Y\"))","v":""},"",{"$f":"IF(J9=\"\",\"\",IFERROR(VLOOKUP(J9,ZCO_BZDD!$B$2:$D$645,3,),\"Y\"))","v":""},"",{"$f":"IF(L9=\"\",\"\",IFERROR(VLOOKUP(L9,ZCO_BZDD!$B$2:$D$645,3,),\"Y\"))","v":""},"",{"$f":"IF(N9=\"\",\"\",IFERROR(VLOOKUP(N9,ZCO_BZDD!$B$2:$D$645,3,),\"Y\"))","v":""},"",{"$f":"IF(P9=\"\",\"\",IFERROR(VLOOKUP(P9,ZCO_BZDD!$B$2:$D$645,3,),\"Y\"))","v":""},"",{"$f":"IF(R9=\"\",\"\",IFERROR(VLOOKUP(R9,ZCO_BZDD!$B$2:$D$645,3,),\"Y\"))","v":""},"",{"$f":"IF(T9=\"\",\"\",IFERROR(VLOOKUP(T9,ZCO_BZDD!$B$2:$D$645,3,),\"Y\"))","v":""}]
[7,{"$f":"EDATE($B$2,7)","v":"2025-11-08"},{"$f":"IFERROR(VLOOKUP(B10,ZCO_BZDD!$B:$D,3,),\"Y\")","v":"N"},"2025-11-09",{"$f":"IF(D10=\"\",\"\",IFERROR(VLOOKUP(D10,ZCO_BZDD!$B$2:$D$645,3,),\"Y\"))","v":"N"},"2025-11-10",{"$f":"IF(F10=\"\",\"\",IFERROR(VLOOKUP(F10,ZCO_BZDD!$B$2:$D$645,3,),\"Y\"))","v":"Y"},"",{"$f":"IF(H10=\"\",\"\",IFERROR(VLOOKUP(H10,ZCO_BZDD!$B$2:$D$645,3,),\"Y\"))","v":""},"",{"$f":"IF(J10=\"\",\"\",IFERROR(VLOOKUP(J10,ZCO_BZDD!$B$2:$D$645,3,),\"Y\"))","v":""},"",{"$f":"IF(L10=\"\",\"\",IFERROR(VLOOKUP(L10,ZCO_BZDD!$B$2:$D$645,3,),\"Y\"))","v":""},"",{"$f":"IF(N10=\"\",\"\",IFERROR(VLOOKUP(N10,ZCO_BZDD!$B$2:$D$645,3,),\"Y\"))","v":""},"",{"$f":"IF(P10=\"\",\"\",IFERROR(VLOOKUP(P10,ZCO_BZDD!$B$2:$D$645,3,),\"Y\"))","v":""},"",{"$f":"IF(R10=\"\",\"\",IFERROR(VLOOKUP(R10,ZCO_BZDD!$B$2:$D$645,3,),\"Y\"))","v":""},"",{"$f":"IF(T10=\"\",\"\",IFERROR(VLOOKUP(T10,ZCO_BZDD!$B$2:$D$645,3,),\"Y\"))","v":""}]
[8,{"$f":"EDATE($B$2,8)","v":"2025-12-08"},{"$f":"IFERROR(VLOOKUP(B11,ZCO_BZDD!$B:$D,3,),\"Y\")","v":"Y"},"",{"$f":"IF(D11=\"\",\"\",IFERROR(VLOOKUP(D11,ZCO_BZDD!$B$2:$D$645,3,),\"Y\"))","v":""},"",{"$f":"IF(F11=\"\",\"\",IFERROR(VLOOKUP(F11,ZCO_BZDD!$B$2:$D$645,3,),\"Y\"))","v":""},"",{"$f":"IF(H11=\"\",\"\",IFERROR(VLOOKUP(H11,ZCO_BZDD!$B$2:$D$645,3,),\"Y\"))","v":""},"",{"$f":"IF(J11=\"\",\"\",IFERROR(VLOOKUP(J11,ZCO_BZDD!$B$2:$D$645,3,),\"Y\"))","v":""},"",{"$f":"IF(L11=\"\",\"\",IFERROR(VLOOKUP(L11,ZCO_BZDD!$B$2:$D$645,3,),\"Y\"))","v":""},"",{"$f":"IF(N11=\"\",\"\",IFERROR(VLOOKUP(N11,ZCO_BZDD!$B$2:$D$645,3,),\"Y\"))","v":""},"",{"$f":"IF(P11=\"\",\"\",IFERROR(VLOOKUP(P11,ZCO_BZDD!$B$2:$D$645,3,),\"Y\"))","v":""},"",{"$f":"IF(R11=\"\",\"\",IFERROR(VLOOKUP(R11,ZCO_BZDD!$B$2:$D$645,3,),\"Y\"))","v":""},"",{"$f":"IF(T11=\"\",\"\",IFERROR(VLOOKUP(T11,ZCO_BZDD!$B$2:$D$645,3,),\"Y\"))","v":""}]
[9,{"$f":"EDATE($B$2,9)","v":"2026-01-08"},{"$f":"IFERROR(VLOOKUP(B12,ZCO_BZDD!$B:$D,3,),\"Y\")","v":"Y"},"",{"$f":"IF(D12=\"\",\"\",IFERROR(VLOOKUP(D12,ZCO_BZDD!$B$2:$D$645,3,),\"Y\"))","v":""},"",{"$f":"IF(F12=\"\",\"\",IFERROR(VLOOKUP(F12,ZCO_BZDD!$B$2:$D$645,3,),\"Y\"))","v":""},"",{"$f":"IF(H12=\"\",\"\",IFERROR(VLOOKUP(H12,ZCO_BZDD!$B$2:$D$645,3,),\"Y\"))","v":""},"",{"$f":"IF(J12=\"\",\"\",IFERROR(VLOOKUP(J12,ZCO_BZDD!$B$2:$D$645,3,),\"Y\"))","v":""},"",{"$f":"IF(L12=\"\",\"\",IFERROR(VLOOKUP(L12,ZCO_BZDD!$B$2:$D$645,3,),\"Y\"))","v":""},"",{"$f":"IF(N12=\"\",\"\",IFERROR(VLOOKUP(N12,ZCO_BZDD!$B$2:$D$645,3,),\"Y\"))","v":""},"",{"$f":"IF(P12=\"\",\"\",IFERROR(VLOOKUP(P12,ZCO_BZDD!$B$2:$D$645,3,),\"Y\"))","v":""},"",{"$f":"IF(R12=\"\",\"\",IFERROR(VLOOKUP(R12,ZCO_BZDD!$B$2:$D$645,3,),\"Y\"))","v":""},"",{"$f":"IF(T12=\"\",\"\",IFERROR(VLOOKUP(T12,ZCO_BZDD!$B$2:$D$645,3,),\"Y\"))","v":""}]
[10,{"$f":"EDATE($B$2,10)","v":"2026-02-08"},{"$f":"IFERROR(VLOOKUP(B13,ZCO_BZDD!$B:$D,3,),\"Y\")","v":"N"},"2026-02-09",{"$f":"IF(D13=\"\",\"\",IFERROR(VLOOKUP(D13,ZCO_BZDD!$B$2:$D$645,3,),\"Y\"))","v":"Y"},"",{"$f":"IF(F13=\"\",\"\",IFERROR(VLOOKUP(F13,ZCO_BZDD!$B$2:$D$645,3,),\"Y\"))","v":""},"",{"$f":"IF(H13=\"\",\"\",IFERROR(VLOOKUP(H13,ZCO_BZDD!$B$2:$D$645,3,),\"Y\"))","v":""},"",{"$f":"IF(J13=\"\",\"\",IFERROR(VLOOKUP(J13,ZCO_BZDD!$B$2:$D$645,3,),\"Y\"))","v":""},"",{"$f":"IF(L13=\"\",\"\",IFERROR(VLOOKUP(L13,ZCO_BZDD!$B$2:$D$645,3,),\"Y\"))","v":""},"",{"$f":"IF(N13=\"\",\"\",IFERROR(VLOOKUP(N13,ZCO_BZDD!$B$2:$D$645,3,),\"Y\"))","v":""},"",{"$f":"IF(P13=\"\",\"\",IFERROR(VLOOKUP(P13,ZCO_BZDD!$B$2:$D$645,3,),\"Y\"))","v":""},"",{"$f":"IF(R13=\"\",\"\",IFERROR(VLOOKUP(R13,ZCO_BZDD!$B$2:$D$645,3,),\"Y\"))","v":""},"",{"$f":"IF(T13=\"\",\"\",IFERROR(VLOOKUP(T13,ZCO_BZDD!$B$2:$D$645,3,),\"Y\"))","v":""}]
[11,{"$f":"EDATE($B$2,11)","v":"2026-03-08"},{"$f":"IFERROR(VLOOKUP(B14,ZCO_BZDD!$B:$D,3,),\"Y\")","v":"N"},"2026-03-09",{"$f":"IF(D14=\"\",\"\",IFERROR(VLOOKUP(D14,ZCO_BZDD!$B$2:$D$645,3,),\"Y\"))","v":"Y"},"",{"$f":"IF(F14=\"\",\"\",IFERROR(VLOOKUP(F14,ZCO_BZDD!$B$2:$D$645,3,),\"Y\"))","v":""},"",{"$f":"IF(H14=\"\",\"\",IFERROR(VLOOKUP(H14,ZCO_BZDD!$B$2:$D$645,3,),\"Y\"))","v":""},"",{"$f":"IF(J14=\"\",\"\",IFERROR(VLOOKUP(J14,ZCO_BZDD!$B$2:$D$645,3,),\"Y\"))","v":""},"",{"$f":"IF(L14=\"\",\"\",IFERROR(VLOOKUP(L14,ZCO_BZDD!$B$2:$D$645,3,),\"Y\"))","v":""},"",{"$f":"IF(N14=\"\",\"\",IFERROR(VLOOKUP(N14,ZCO_BZDD!$B$2:$D$645,3,),\"Y\"))","v":""},"",{"$f":"IF(P14=\"\",\"\",IFERROR(VLOOKUP(P14,ZCO_BZDD!$B$2:$D$645,3,),\"Y\"))","v":""},"",{"$f":"IF(R14=\"\",\"\",IFERROR(VLOOKUP(R14,ZCO_BZDD!$B$2:$D$645,3,),\"Y\"))","v":""},"",{"$f":"IF(T14=\"\",\"\",IFERROR(VLOOKUP(T14,ZCO_BZDD!$B$2:$D$645,3,),\"Y\"))","v":""}]
[12,{"$f":"EDATE($B$2,12)-1","v":"2026-04-07"},{"$f":"IFERROR(VLOOKUP(B15,ZCO_BZDD!$B:$D,3,),\"Y\")","v":"Y"},{"$f":"IF(C15=\"Y\",\"\",B15-1)","v":""},{"$f":"IF(D15=\"\",\"\",IFERROR(VLOOKUP(D15,ZCO_BZDD!$B$2:$D$645,3,),\"Y\"))","v":""},{"$f":"IFERROR(IF(E15=\"Y\",\"\",D15-1),\"\")","v":""},{"$f":"IF(F15=\"\",\"\",IFERROR(VLOOKUP(F15,ZCO_BZDD!$B$2:$D$645,3,),\"Y\"))","v":""},{"$f":"IFERROR(IF(G15=\"Y\",\"\",F15-1),\"\")","v":""},{"$f":"IF(H15=\"\",\"\",IFERROR(VLOOKUP(H15,ZCO_BZDD!$B$2:$D$645,3,),\"Y\"))","v":""},{"$f":"IFERROR(IF(I15=\"Y\",\"\",H15-1),\"\")","v":""},{"$f":"IF(J15=\"\",\"\",IFERROR(VLOOKUP(J15,ZCO_BZDD!$B$2:$D$645,3,),\"Y\"))","v":""},{"$f":"IFERROR(IF(K15=\"Y\",\"\",J15-1),\"\")","v":""},{"$f":"IF(L15=\"\",\"\",IFERROR(VLOOKUP(L15,ZCO_BZDD!$B$2:$D$645,3,),\"Y\"))","v":""},{"$f":"IFERROR(IF(M15=\"Y\",\"\",L15-1),\"\")","v":""},{"$f":"IF(N15=\"\",\"\",IFERROR(VLOOKUP(N15,ZCO_BZDD!$B$2:$D$645,3,),\"Y\"))","v":""},{"$f":"IFERROR(IF(O15=\"Y\",\"\",N15-1),\"\")","v":""},{"$f":"IF(P15=\"\",\"\",IFERROR(VLOOKUP(P15,ZCO_BZDD!$B$2:$D$645,3,),\"Y\"))","v":""},{"$f":"IFERROR(IF(Q15=\"Y\",\"\",P15-1),\"\")","v":""},{"$f":"IF(R15=\"\",\"\",IFERROR(VLOOKUP(R15,ZCO_BZDD!$B$2:$D$645,3,),\"Y\"))","v":""},{"$f":"IFERROR(IF(S15=\"Y\",\"\",R15-1),\"\")","v":""},{"$f":"IF(T15=\"\",\"\",IFERROR(VLOOKUP(T15,ZCO_BZDD!$B$2:$D$645,3,),\"Y\"))","v":""}]
[]
["회차","최종일자"]
[1,{"$f":"MAX(B4:U4)","v":"2025-05-08"}]
[2,"2025-06-09"]
[3,"2025-07-08"]
[4,"2025-08-08"]
[5,"2025-09-08"]
[6,"2025-10-10"]
[7,"2025-11-10"]
[8,"2025-12-08"]
[9,"2026-01-08"]
[10,"2026-02-09"]
[11,"2026-03-09"]
[12,{"$f":"MIN(B15:U15)","v":"2026-04-07"}]

{"sheet":"상환금","index":3,"n_rows":17,"n_cols":4,"rows_kept":17,"cut":false,"hidden":true,"merged":[]}
[]
["승인회차",{"$f":"분할상환계획표!E11","v":12}]
[]
["신청금액",{"$f":"분할상환계획표!E7","v":0},{"$f":"($B$2-1)*$B$6","v":0},{"$f":"B4-C4","v":0}]
[]
[1,{"$f":"IFERROR(ROUNDDOWN(IF($B$2>$A6,$B$4/$B$2,IF($B$2=$A6,$B$4-$C$4,\"\")),-1),\"\")","v":0}]
[2,{"$f":"IFERROR(ROUNDDOWN(IF($B$2>$A7,$B$4/$B$2,IF($B$2=$A7,$B$4-$C$4,\"\")),-1),\"\")","v":0}]
[3,0]
[4,0]
[5,0]
[6,0]
[7,0]
[8,0]
[9,0]
[10,0]
[11,0]
[12,0]