{"text_format":"2","workbook":"xlsx","n_sheets":4,"sheets":["분할상환계획표","ZCO_BZDD","상환일","상환금"],"not_rendered":{"charts":0,"images":0,"macros":0,"external_links":0,"defined_names":0,"comments":0,"pivot_tables":0},"unopened":[],"bounds":{"document_bytes":16777216,"sheet_cells":100000,"run_cost":"one","rows_first":2000,"rows_last":500,"rows_between":2000,"halvings":0,"cell_chars":16384,"cell_head_chars":4096},"cells_cut":0,"cells_raw":0,"read":"whole","date_system":"1900"}

{"sheet":"분할상환계획표","index":0,"n_rows":23,"n_cols":8,"rows_kept":23,"cut":false,"hidden":false,"merged":[[17,5,17,6],[13,5,13,6],[13,7,13,8],[15,5,15,6],[15,7,15,8],[16,5,16,6],[16,7,16,8],[22,1,22,8],[21,1,21,8],[18,5,18,6],[18,7,18,8],[19,1,19,6],[19,7,19,8],[20,1,20,6],[17,7,17,8],[1,1,1,8],[6,1,6,3],[6,4,6,8],[3,1,4,3],[3,4,4,5],[3,6,4,6],[3,7,4,8],[8,1,8,3],[8,4,8,8],[10,1,10,3],[10,4,10,8],[14,5,14,6],[14,7,14,8],[12,5,12,6],[12,7,12,8]]}
[]
[null,"기본운영자금 한도초과금액 분할상환 계획표"]
[]
[null,"기본운영자금 거래번호",null,null,2024,null,"-",12345]
[]
[]
[null,"기본운영자금 한도초과금액\n(분할상환 신청금액)",null,null,0]
[]
[null,"분할상환 승인일",null,null,"2025-04-08"]
[]
[null,"분할상환 승인회차",null,null,12]
[]
[null,"회차","분할상환일","분할상환금액","회차","분할상환일",null,"분할상환금액"]
[null,1,{"$f":"상환일!B18","v":"2025-05-08"},{"$f":"상환금!B6","v":0},7,{"$f":"상환일!B24","v":"2025-11-10"},null,{"$f":"상환금!B12","v":0}]
[null,2,{"$f":"상환일!B19","v":"2025-06-09"},{"$f":"상환금!B7","v":0},8,{"$f":"상환일!B25","v":"2025-12-08"},null,{"$f":"상환금!B13","v":0}]
[null,3,{"$f":"상환일!B20","v":"2025-07-08"},{"$f":"상환금!B8","v":0},9,{"$f":"상환일!B26","v":"2026-01-08"},null,{"$f":"상환금!B14","v":0}]
[null,4,{"$f":"상환일!B21","v":"2025-08-08"},{"$f":"상환금!B9","v":0},10,{"$f":"상환일!B27","v":"2026-02-09"},null,{"$f":"상환금!B15","v":0}]
[null,5,{"$f":"상환일!B22","v":"2025-09-08"},{"$f":"상환금!B10","v":0},11,{"$f":"상환일!B28","v":"2026-03-09"},null,{"$f":"상환금!B16","v":0}]
[null,6,{"$f":"상환일!B23","v":"2025-10-10"},{"$f":"상환금!B11","v":0},12,{"$f":"상환일!B29","v":"2026-04-07"},null,{"$f":"상환금!B17","v":0}]
[null,"분할상환금액 합계",{"$nulls":5},{"$f":"SUM($D$14:$D$19,$H$14:$I$19)","v":0}]
[]
[null,"(입력사항) \n  1. 기본운영자금 거래번호를 입력합니다. (모르시는 경우 영업점에 문의 바랍니다.)\n  2. \"기본운영자금 한도초과금액\"란에 분할상환 승인받을 기본운영자금 한도초과금액을 \n      입력하시면 매월 납부하실 분할상환금액이 자동 계산됩니다. \n  3. 분할상환 승인일과 승인회차를 입력합니다. 분할상환일은 분할상환 승인일 이후 12개월간, \n     매월의 분할상환승인일과 같은 날짜로 자동 입력됩니다.(해당일이 휴일인경우 다음 영업일\n     이며, 최종회차 분할상환일은 한도내 금액의 연장 상환기한과 동일함) \n\n※ 분할상환일 사례\n당초 1억원의 기본운영자금 상환기한이 ‘22. 12. 7.(수)이고, 한도내 금액인 8천만원의 연장 상환기한이 '23. 12. 6.(수)이며, 한도초과로 2천만원을 ’22. 12. 7.(수)에 분할상환 승인받을 경우, 1회차 분할상환일은 분할상환 승인일 한 달 뒤인 ‘23. 1. 7.(토)이나 해당일이 휴일이므로, ’23. 1. 9.(월)이 분할상환일이 되고, 2회차 분할상환일은 ‘23. 2. 7.(화)이 되는 등 매월 7일자로 납부하여야 함. 다만, 마지막 12회차 분할상환일은 한도내 금액의 연장 상환기한인 '23. 12. 6.(수)이 됨."]
[null,"(분할상환금액 및 이자금액)*\n 1. 분할상환일 : 분할상환 승인 기간(분할상환 승인일 이후 12개월) 동안 분할상환 \n    승인일과 매월 같은 날짜(해당일이 휴일인 경우 다음 영업일이며, 최종회차 분할상환일\n    은 한도내 금액의 연장 상환기한과 동일함)\n 2. 매월 납부할 분할상환금액 : 분할상환 승인 기본운영자금 한도초과금액 ÷ 12회\n    (10원미만 절사하고, 절사금액 합은 최종 12회차에 납부)\n 3. 회차별 이자금액 : 분할상환 승인 기본융자 한도초과잔액 × 이자율 × 회차별 일수/365\n 4. 각 분할상환일에 이자를 납부해야하며, 조합 홈페이지 인터넷창구 “조회>>\n    융자조회>>융자금이자산출” 화면에서 이자금액 조회 가능\n* 해당 안내문은 정상적인 분할상환 신청을 전제로 하며, 그 밖의 자세한 사항은 관할 영업점에 문의"]

{"sheet":"ZCO_BZDD","index":1,"n_rows":645,"n_cols":6,"rows_kept":645,"cut":false,"hidden":true,"merged":[]}
["BZDA",null,"SALS_YM","BZDD_YN","LAST_CHNG_DTTM","LAST_CHNR_ID"]
[20240630,{"$f":"DATE(LEFT(A2,4),MID(A2,5,2),RIGHT(A2,2))","v":"2024-06-30"},202406,"N","2021/06/04 오후 13:42:17.102000",2008005]
[20240706,{"$f":"DATE(LEFT(A3,4),MID(A3,5,2),RIGHT(A3,2))","v":"2024-07-06"},202407,"N","2021/06/04 오후 13:42:17.102000",2008005]
[20240707,"2024-07-07",202407,"N","2021/06/04 오후 13:42:17.102000",2008005]
[20240713,"2024-07-13",202407,"N","2021/06/04 오후 13:42:17.102000",2008005]
[20240714,"2024-07-14",202407,"N","2021/06/04 오후 13:42:17.102000",2008005]
[20240720,"2024-07-20",202407,"N","2021/06/04 오후 13:42:17.102000",2008005]
[20240721,"2024-07-21",202407,"N","2021/06/04 오후 13:42:17.102000",2008005]
[20240727,"2024-07-27",202407,"N","2021/06/04 오후 13:42:17.102000",2008005]
[20240728,"2024-07-28",202407,"N","2021/06/04 오후 13:42:17.102000",2008005]
[20240803,"2024-08-03",202408,"N","2021/06/04 오후 13:42:17.102000",2008005]
[20240804,"2024-08-04",202408,"N","2021/06/04 오후 13:42:17.102000",2008005]
[20240810,"2024-08-10",202408,"N","2021/06/04 오후 13:42:17.102000",2008005]
[20240811,"2024-08-11",202408,"N","2021/06/04 오후 13:42:17.102000",2008005]
[20240815,"2024-08-15",202408,"N","2021/06/04 오후 13:42:17.102000",2008005]
[20240817,"2024-08-17",202408,"N","2021/06/04 오후 13:42:17.102000",2008005]
[20240818,"2024-08-18",202408,"N","2021/06/04 오후 13:42:17.102000",2008005]
[20240824,"2024-08-24",202408,"N","2021/06/04 오후 13:42:17.102000",2008005]
[20240825,"2024-08-25",202408,"N","2021/06/04 오후 13:42:17.102000",2008005]
[20240831,"2024-08-31",202408,"N","2021/06/04 오후 13:42:17.102000",2008005]
[20240901,"2024-09-01",202409,"N","2021/06/04 오후 13:42:17.102000",2008005]
[20240907,"2024-09-07",202409,"N","2021/06/04 오후 13:42:17.102000",2008005]
[20240908,"2024-09-08",202409,"N","2021/06/04 오후 13:42:17.102000",2008005]
[20240914,"2024-09-14",202409,"N","2021/06/04 오후 13:42:17.102000",2008005]
[20240915,"2024-09-15",202409,"N","2021/06/04 오후 13:42:17.102000",2008005]
[20240916,"2024-09-16",202409,"N","2021/06/04 오후 13:42:17.102000",2008005]
[20240917,"2024-09-17",202409,"N","2021/06/04 오후 13:42:17.102000",2008005]
[20240918,"2024-09-18",202409,"N","2021/06/04 오후 13:42:17.102000",2008005]
[20240921,"2024-09-21",202409,"N","2021/06/04 오후 13:42:17.102000",2008005]
[20240922,"2024-09-22",202409,"N","2021/06/04 오후 13:42:17.102000",2008005]
[20240928,"2024-09-28",202409,"N","2021/06/04 오후 13:42:17.102000",2008005]
[20240929,"2024-09-29",202409,"N","2021/06/04 오후 13:42:17.102000",2008005]
[20241003,"2024-10-03",202410,"N","2021/06/04 오후 13:42:17.102000",2008005]
[20241005,"2024-10-05",202410,"N","2021/06/04 오후 13:42:17.102000",2008005]
[20241006,"2024-10-06",202410,"N","2021/06/04 오후 13:42:17.102000",2008005]
[20241009,"2024-10-09",202410,"N","2021/06/04 오후 13:42:17.102000",2008005]
[20241012,"2024-10-12",202410,"N","2021/06/04 오후 13:42:17.102000",2008005]
[20241013,"2024-10-13",202410,"N","2021/06/04 오후 13:42:17.102000",2008005]
[20241019,"2024-10-19",202410,"N","2021/06/04 오후 13:42:17.102000",2008005]
[20241020,"2024-10-20",202410,"N","2021/06/04 오후 13:42:17.102000",2008005]
[20241026,"2024-10-26",202410,"N","2021/06/04 오후 13:42:17.102000",2008005]
[20241027,"2024-10-27",202410,"N","2021/06/04 오후 13:42:17.102000",2008005]
[20241102,"2024-11-02",202411,"N","2021/06/04 오후 13:42:17.102000",2008005]
[20241103,"2024-11-03",202411,"N","2021/06/04 오후 13:42:17.102000",2008005]
[20241109,"2024-11-09",202411,"N","2021/06/04 오후 13:42:17.102000",2008005]
[20241110,"2024-11-10",202411,"N","2021/06/04 오후 13:42:17.102000",2008005]
[20241116,"2024-11-16",202411,"N","2021/06/04 오후 13:42:17.102000",2008005]
[20241117,"2024-11-17",202411,"N","2021/06/04 오후 13:42:17.102000",2008005]
[20241123,"2024-11-23",202411,"N","2021/06/04 오후 13:42:17.102000",2008005]
[20241124,"2024-11-24",202411,"N","2021/06/04 오후 13:42:17.102000",2008005]
[20241130,"2024-11-30",202411,"N","2021/06/04 오후 13:42:17.102000",2008005]
[20241201,"2024-12-01",202412,"N","2021/06/04 오후 13:42:17.102000",2008005]
[20241207,"2024-12-07",202412,"N","2021/06/04 오후 13:42:17.102000",2008005]
[20241208,"2024-12-08",202412,"N","2021/06/04 오후 13:42:17.102000",2008005]
[20241214,"2024-12-14",202412,"N","2021/06/04 오후 13:42:17.102000",2008005]
[20241215,"2024-12-15",202412,"N","2021/06/04 오후 13:42:17.102000",2008005]
[20241221,"2024-12-21",202412,"N","2021/06/04 오후 13:42:17.102000",2008005]
[20241222,"2024-12-22",202412,"N","2021/06/04 오후 13:42:17.102000",2008005]
[20241225,"2024-12-25",202412,"N","2021/06/04 오후 13:42:17.102000",2008005]
[20241228,"2024-12-28",202412,"N","2021/06/04 오후 13:42:17.102000",2008005]
[20241229,"2024-12-29",202412,"N","2021/06/04 오후 13:42:17.102000",2008005]
[20250101,"2025-01-01",202501,"N","2021/06/04 오후 14:10:48.430000",2008005]
[20250104,"2025-01-04",202501,"N","2021/06/04 오후 14:10:48.430000",2008005]
[20250105,"2025-01-05",202501,"N","2021/06/04 오후 14:10:48.430000",2008005]
[20250111,"2025-01-11",202501,"N","2021/06/04 오후 14:10:48.430000",2008005]
[20250112,"2025-01-12",202501,"N","2021/06/04 오후 14:10:48.430000",2008005]
[20250118,{"$f":"DATE(LEFT(A67,4),MID(A67,5,2),RIGHT(A67,2))","v":"2025-01-18"},202501,"N","2021/06/04 오후 14:10:48.430000",2008005]
[20250119,"2025-01-19",202501,"N","2021/06/04 오후 14:10:48.430000",2008005]
[20250125,"2025-01-25",202501,"N","2021/06/04 오후 14:10:48.430000",2008005]
[20250126,"2025-01-26",202501,"N","2021/06/04 오후 14:10:48.430000",2008005]
[20250128,"2025-01-28",202501,"N","2021/06/04 오후 14:10:48.430000",2008005]
[20250129,"2025-01-29",202501,"N","2021/06/04 오후 14:10:48.430000",2008005]
[20250130,"2025-01-30",202501,"N","2021/06/04 오후 14:10:48.430000",2008005]
[20250201,"2025-02-01",202502,"N","2021/06/04 오후 13:42:18.833000",2008005]
[20250202,"2025-02-02",202502,"N","2021/06/04 오후 13:42:18.833000",2008005]
[20250208,"2025-02-08",202502,"N","2021/06/04 오후 13:42:18.833000",2008005]
[20250209,"2025-02-09",202502,"N","2021/06/04 오후 13:42:18.833000",2008005]
[20250215,"2025-02-15",202502,"N","2021/06/04 오후 13:42:18.833000",2008005]
[20250216,"2025-02-16",202502,"N","2021/06/04 오후 13:42:18.833000",2008005]
[20250222,"2025-02-22",202502,"N","2021/06/04 오후 13:42:18.833000",2008005]
[20250223,"2025-02-23",202502,"N","2021/06/04 오후 13:42:18.833000",2008005]
[20250301,"2025-03-01",202503,"N","2024/07/02 오전 9:14:08.468000",2007006]
[20250302,"2025-03-02",202503,"N","2024/07/02 오전 9:14:08.468000",2007006]
[20250303,"2025-03-03",202503,"N","2024/07/02 오전 9:14:08.468000",2007006]
[20250308,"2025-03-08",202503,"N","2024/07/02 오전 9:14:08.468000",2007006]
[20250309,"2025-03-09",202503,"N","2024/07/02 오전 9:14:08.468000",2007006]
[20250315,"2025-03-15",202503,"N","2024/07/02 오전 9:14:08.468000",2007006]
[20250316,"2025-03-16",202503,"N","2024/07/02 오전 9:14:08.468000",2007006]
[20250322,"2025-03-22",202503,"N","2024/07/02 오전 9:14:08.468000",2007006]
[20250323,"2025-03-23",202503,"N","2024/07/02 오전 9:14:08.468000",2007006]
[20250329,"2025-03-29",202503,"N","2024/07/02 오전 9:14:08.468000",2007006]
[20250330,"2025-03-30",202503,"N","2024/07/02 오전 9:14:08.468000",2007006]
[20250405,"2025-04-05",202504,"N","2021/06/04 오후 13:42:18.833000",2008005]
[20250406,"2025-04-06",202504,"N","2021/06/04 오후 13:42:18.833000",2008005]
[20250412,"2025-04-12",202504,"N","2021/06/04 오후 13:42:18.833000",2008005]
[20250413,"2025-04-13",202504,"N","2021/06/04 오후 13:42:18.833000",2008005]
[20250419,"2025-04-19",202504,"N","2021/06/04 오후 13:42:18.833000",2008005]
[20250420,"2025-04-20",202504,"N","2021/06/04 오후 13:42:18.833000",2008005]
[20250426,"2025-04-26",202504,"N","2021/06/04 오후 13:42:18.833000",2008005]
[20250427,"2025-04-27",202504,"N","2021/06/04 오후 13:42:18.833000",2008005]
[20250501,"2025-05-01",202505,"N","2024/07/02 오후 14:19:15.927000",2003029]
[20250503,"2025-05-03",202505,"N","2024/07/02 오후 14:19:15.927000",2003029]
[20250504,"2025-05-04",202505,"N","2024/07/02 오후 14:19:15.927000",2003029]
[20250505,"2025-05-05",202505,"N","2024/07/02 오후 14:19:15.927000",2003029]
[20250506,"2025-05-06",202505,"N","2024/07/02 오후 14:19:15.927000",2003029]
[20250510,"2025-05-10",202505,"N","2024/07/02 오후 14:19:15.927000",2003029]
[20250511,"2025-05-11",202505,"N","2024/07/02 오후 14:19:15.927000",2003029]
[20250517,"2025-05-17",202505,"N","2024/07/02 오후 14:19:15.927000",2003029]
[20250518,"2025-05-18",202505,"N","2024/07/02 오후 14:19:15.927000",2003029]
[20250524,"2025-05-24",202505,"N","2024/07/02 오후 14:19:15.927000",2003029]
[20250525,"2025-05-25",202505,"N","2024/07/02 오후 14:19:15.927000",2003029]
[20250531,"2025-05-31",202505,"N","2024/07/02 오후 14:19:15.927000",2003029]
[20250601,"2025-06-01",202506,"N","2021/06/04 오후 13:42:18.833000",2008005]
[20250603,{"$f":"DATE(LEFT(A114,4),MID(A114,5,2),RIGHT(A114,2))","v":"2025-06-03"},202506,"N","2021/06/04 오후 13:42:18.833000",2008005]
[20250606,"2025-06-06",202506,"N","2021/06/04 오후 13:42:18.833000",2008005]
[20250607,"2025-06-07",202506,"N","2021/06/04 오후 13:42:18.833000",2008005]
[20250608,"2025-06-08",202506,"N","2021/06/04 오후 13:42:18.833000",2008005]
[20250614,"2025-06-14",202506,"N","2021/06/04 오후 13:42:18.833000",2008005]
[20250615,"2025-06-15",202506,"N","2021/06/04 오후 13:42:18.833000",2008005]
[20250621,"2025-06-21",202506,"N","2021/06/04 오후 13:42:18.833000",2008005]
[20250622,"2025-06-22",202506,"N","2021/06/04 오후 13:42:18.833000",2008005]
[20250628,"2025-06-28",202506,"N","2021/06/04 오후 13:42:18.833000",2008005]
[20250629,"2025-06-29",202506,"N","2021/06/04 오후 13:42:18.833000",2008005]
[20250705,"2025-07-05",202507,"N","2021/06/04 오후 13:42:18.833000",2008005]
[20250706,"2025-07-06",202507,"N","2021/06/04 오후 13:42:18.833000",2008005]
[20250712,"2025-07-12",202507,"N","2021/06/04 오후 13:42:18.833000",2008005]
[20250713,"2025-07-13",202507,"N","2021/06/04 오후 13:42:18.833000",2008005]
[20250719,"2025-07-19",202507,"N","2021/06/04 오후 13:42:18.833000",2008005]
[20250720,"2025-07-20",202507,"N","2021/06/04 오후 13:42:18.833000",2008005]
[20250726,"2025-07-26",202507,"N","2021/06/04 오후 13:42:18.833000",2008005]
[20250727,"2025-07-27",202507,"N","2021/06/04 오후 13:42:18.833000",2008005]
[20250802,{"$f":"DATE(LEFT(A132,4),MID(A132,5,2),RIGHT(A132,2))","v":"2025-08-02"},202508,"N","2021/06/04 오후 13:42:18.833000",2008005]
[20250803,"2025-08-03",202508,"N","2021/06/04 오후 13:42:18.833000",2008005]
[20250809,"2025-08-09",202508,"N","2021/06/04 오후 13:42:18.833000",2008005]
[20250810,"2025-08-10",202508,"N","2021/06/04 오후 13:42:18.833000",2008005]
[20250815,"2025-08-15",202508,"N","2021/06/04 오후 13:42:18.833000",2008005]
[20250816,"2025-08-16",202508,"N","2021/06/04 오후 13:42:18.833000",2008005]
[20250817,"2025-08-17",202508,"N","2021/06/04 오후 13:42:18.833000",2008005]
[20250823,"2025-08-23",202508,"N","2021/06/04 오후 13:42:18.833000",2008005]
[20250824,"2025-08-24",202508,"N","2021/06/04 오후 13:42:18.833000",2008005]
[20250830,"2025-08-30",202508,"N","2021/06/04 오후 13:42:18.833000",2008005]
[20250831,"2025-08-31",202508,"N","2021/06/04 오후 13:42:18.833000",2008005]
[20250906,"2025-09-06",202509,"N","2021/06/04 오후 13:42:18.833000",2008005]
[20250907,"2025-09-07",202509,"N","2021/06/04 오후 13:42:18.833000",2008005]
[20250913,"2025-09-13",202509,"N","2021/06/04 오후 13:42:18.833000",2008005]
[20250914,"2025-09-14",202509,"N","2021/06/04 오후 13:42:18.833000",2008005]
[20250920,"2025-09-20",202509,"N","2021/06/04 오후 13:42:18.833000",2008005]
[20250921,"2025-09-21",202509,"N","2021/06/04 오후 13:42:18.833000",2008005]
[20250927,"2025-09-27",202509,"N","2021/06/04 오후 13:42:18.833000",2008005]
[20250928,"2025-09-28",202509,"N","2021/06/04 오후 13:42:18.833000",2008005]
[20251003,"2025-10-03",202510,"N","2021/06/04 오후 14:10:18.501000",2008005]
[20251004,"2025-10-04",202510,"N","2021/06/04 오후 14:10:18.501000",2008005]
[20251005,"2025-10-05",202510,"N","2021/06/04 오후 14:10:18.501000",2008005]
[20251006,"2025-10-06",202510,"N","2021/06/04 오후 14:10:18.501000",2008005]
[20251007,"2025-10-07",202510,"N","2021/06/04 오후 14:10:18.501000",2008005]
[20251008,"2025-10-08",202510,"N","2021/06/04 오후 14:10:18.501000",2008005]
[20251009,"2025-10-09",202510,"N","2021/06/04 오후 14:10:18.501000",2008005]
[20251011,"2025-10-11",202510,"N","2021/06/04 오후 14:10:18.501000",2008005]
[20251012,"2025-10-12",202510,"N","2021/06/04 오후 14:10:18.501000",2008005]
[20251018,"2025-10-18",202510,"N","2021/06/04 오후 14:10:18.501000",2008005]
[20251019,"2025-10-19",202510,"N","2021/06/04 오후 14:10:18.501000",2008005]
[20251025,"2025-10-25",202510,"N","2021/06/04 오후 14:10:18.501000",2008005]
[20251026,"2025-10-26",202510,"N","2021/06/04 오후 14:10:18.501000",2008005]
[20251101,"2025-11-01",202511,"N","2021/06/04 오후 13:42:18.833000",2008005]
[20251102,"2025-11-02",202511,"N","2021/06/04 오후 13:42:18.833000",2008005]
[20251108,"2025-11-08",202511,"N","2021/06/04 오후 13:42:18.833000",2008005]
[20251109,"2025-11-09",202511,"N","2021/06/04 오후 13:42:18.833000",2008005]
[20251115,"2025-11-15",202511,"N","2021/06/04 오후 13:42:18.833000",2008005]
[20251116,"2025-11-16",202511,"N","2021/06/04 오후 13:42:18.833000",2008005]
[20251122,"2025-11-22",202511,"N","2021/06/04 오후 13:42:18.833000",2008005]
[20251123,"2025-11-23",202511,"N","2021/06/04 오후 13:42:18.833000",2008005]
[20251129,"2025-11-29",202511,"N","2021/06/04 오후 13:42:18.833000",2008005]
[20251130,"2025-11-30",202511,"N","2021/06/04 오후 13:42:18.833000",2008005]
[20251206,"2025-12-06",202512,"N","2021/06/04 오후 13:42:18.833000",2008005]
[20251207,"2025-12-07",202512,"N","2021/06/04 오후 13:42:18.833000",2008005]
[20251213,"2025-12-13",202512,"N","2021/06/04 오후 13:42:18.833000",2008005]
[20251214,"2025-12-14",202512,"N","2021/06/04 오후 13:42:18.833000",2008005]
[20251220,"2025-12-20",202512,"N","2021/06/04 오후 13:42:18.833000",2008005]
[20251221,"2025-12-21",202512,"N","2021/06/04 오후 13:42:18.833000",2008005]
[20251225,"2025-12-25",202512,"N","2021/06/04 오후 13:42:18.833000",2008005]
[20251227,"2025-12-27",202512,"N","2021/06/04 오후 13:42:18.833000",2008005]
[20251228,"2025-12-28",202512,"N","2021/06/04 오후 13:42:18.833000",2008005]
[20260101,"2026-01-01",202601,"N","2023/01/02 오전 10:54:21.197000",2005007]
[20260103,"2026-01-03",202601,"N","2023/01/02 오전 10:54:21.197000",2005007]
[20260104,"2026-01-04",202601,"N","2023/01/02 오전 10:54:21.197000",2005007]
[20260110,"2026-01-10",202601,"N","2023/01/02 오전 10:54:21.197000",2005007]
[20260111,"2026-01-11",202601,"N","2023/01/02 오전 10:54:21.197000",2005007]
[20260117,"2026-01-17",202601,"N","2023/01/02 오전 10:54:21.197000",2005007]
[20260118,"2026-01-18",202601,"N","2023/01/02 오전 10:54:21.197000",2005007]
[20260124,"2026-01-24",202601,"N","2023/01/02 오전 10:54:21.197000",2005007]
[20260125,"2026-01-25",202601,"N","2023/01/02 오전 10:54:21.197000",2005007]
[20260131,"2026-01-31",202601,"N","2023/01/02 오전 10:54:21.197000",2005007]
[20260201,"2026-02-01",202602,"N","2024/07/02 오후 14:21:55.873000",2003029]
[20260207,"2026-02-07",202602,"N","2024/07/02 오후 14:21:55.873000",2003029]
[20260208,"2026-02-08",202602,"N","2024/07/02 오후 14:21:55.873000",2003029]
[20260214,{"$f":"DATE(LEFT(A196,4),MID(A196,5,2),RIGHT(A196,2))","v":"2026-02-14"},202602,"N","2024/07/02 오후 14:21:55.873000",2003029]
[20260215,"2026-02-15",202602,"N","2024/07/02 오후 14:21:55.873000",2003029]
[20260216,"2026-02-16",202602,"N","2024/07/02 오후 14:21:55.873000",2003029]
[20260217,"2026-02-17",202602,"N","2024/07/02 오후 14:21:55.873000",2003029]
[20260218,"2026-02-18",202602,"N","2024/07/02 오후 14:21:55.873000",2003029]
[20260221,"2026-02-21",202602,"N","2024/07/02 오후 14:21:55.873000",2003029]
[20260222,"2026-02-22",202602,"N","2024/07/02 오후 14:21:55.873000",2003029]
[20260228,"2026-02-28",202602,"N","2024/07/02 오후 14:21:55.873000",2003029]
[20260301,"2026-03-01",202603,"N","2024/07/02 오후 14:22:14.102000",2003029]
[20260302,"2026-03-02",202603,"N","2024/07/02 오후 14:22:14.102000",2003029]
[20260307,"2026-03-07",202603,"N","2024/07/02 오후 14:22:14.102000",2003029]
[20260308,"2026-03-08",202603,"N","2024/07/02 오후 14:22:14.102000",2003029]
[20260314,"2026-03-14",202603,"N","2024/07/02 오후 14:22:14.102000",2003029]
[20260315,"2026-03-15",202603,"N","2024/07/02 오후 14:22:14.102000",2003029]
[20260321,"2026-03-21",202603,"N","2024/07/02 오후 14:22:14.102000",2003029]
[20260322,"2026-03-22",202603,"N","2024/07/02 오후 14:22:14.102000",2003029]
[20260328,"2026-03-28",202603,"N","2024/07/02 오후 14:22:14.102000",2003029]
[20260329,"2026-03-29",202603,"N","2024/07/02 오후 14:22:14.102000",2003029]
[20260404,"2026-04-04",202604,"N","2023/01/02 오전 10:54:21.197000",2005007]
[20260405,"2026-04-05",202604,"N","2023/01/02 오전 10:54:21.197000",2005007]
[20260411,"2026-04-11",202604,"N","2023/01/02 오전 10:54:21.197000",2005007]
[20260412,"2026-04-12",202604,"N","2023/01/02 오전 10:54:21.197000",2005007]
[20260418,"2026-04-18",202604,"N","2023/01/02 오전 10:54:21.197000",2005007]
[20260419,"2026-04-19",202604,"N","2023/01/02 오전 10:54:21.197000",2005007]
[20260425,"2026-04-25",202604,"N","2023/01/02 오전 10:54:21.197000",2005007]
[20260426,"2026-04-26",202604,"N","2023/01/02 오전 10:54:21.197000",2005007]
[20260501,"2026-05-01",202605,"N","2024/07/02 오후 14:22:26.835000",2003029]
[20260502,"2026-05-02",202605,"N","2024/07/02 오후 14:22:26.835000",2003029]
[20260503,"2026-05-03",202605,"N","2024/07/02 오후 14:22:26.835000",2003029]
[20260505,"2026-05-05",202605,"N","2024/07/02 오후 14:22:26.835000",2003029]
[20260509,"2026-05-09",202605,"N","2024/07/02 오후 14:22:26.835000",2003029]
[20260510,"2026-05-10",202605,"N","2024/07/02 오후 14:22:26.835000",2003029]
[20260516,"2026-05-16",202605,"N","2024/07/02 오후 14:22:26.835000",2003029]
[20260517,"2026-05-17",202605,"N","2024/07/02 오후 14:22:26.835000",2003029]
[20260523,"2026-05-23",202605,"N","2024/07/02 오후 14:22:26.835000",2003029]
[20260524,"2026-05-24",202605,"N","2024/07/02 오후 14:22:26.835000",2003029]
[20260525,"2026-05-25",202605,"N","2024/07/02 오후 14:22:26.835000",2003029]
[20260530,"2026-05-30",202605,"N","2024/07/02 오후 14:22:26.835000",2003029]
[20260531,"2026-05-31",202605,"N","2024/07/02 오후 14:22:26.835000",2003029]
[20260606,"2026-06-06",202606,"N","2023/01/02 오전 10:54:21.197000",2005007]
[20260607,"2026-06-07",202606,"N","2023/01/02 오전 10:54:21.197000",2005007]
[20260613,"2026-06-13",202606,"N","2023/01/02 오전 10:54:21.197000",2005007]
[20260614,"2026-06-14",202606,"N","2023/01/02 오전 10:54:21.197000",2005007]
[20260620,"2026-06-20",202606,"N","2023/01/02 오전 10:54:21.197000",2005007]
[20260621,"2026-06-21",202606,"N","2023/01/02 오전 10:54:21.197000",2005007]
[20260627,"2026-06-27",202606,"N","2023/01/02 오전 10:54:21.197000",2005007]
[20260628,"2026-06-28",202606,"N","2023/01/02 오전 10:54:21.197000",2005007]
[20260704,"2026-07-04",202607,"N","2023/01/02 오전 10:54:21.197000",2005007]
[20260705,"2026-07-05",202607,"N","2023/01/02 오전 10:54:21.197000",2005007]
[20260711,"2026-07-11",202607,"N","2023/01/02 오전 10:54:21.197000",2005007]
[20260712,"2026-07-12",202607,"N","2023/01/02 오전 10:54:21.197000",2005007]
[20260718,"2026-07-18",202607,"N","2023/01/02 오전 10:54:21.197000",2005007]
[20260719,"2026-07-19",202607,"N","2023/01/02 오전 10:54:21.197000",2005007]
[20260725,"2026-07-25",202607,"N","2023/01/02 오전 10:54:21.197000",2005007]
[20260726,"2026-07-26",202607,"N","2023/01/02 오전 10:54:21.197000",2005007]
[20260801,"2026-08-01",202608,"N","2023/01/02 오전 10:54:21.197000",2005007]
[20260802,"2026-08-02",202608,"N","2023/01/02 오전 10:54:21.197000",2005007]
[20260808,"2026-08-08",202608,"N","2023/01/02 오전 10:54:21.197000",2005007]
[20260809,"2026-08-09",202608,"N","2023/01/02 오전 10:54:21.197000",2005007]
[20260815,"2026-08-15",202608,"N","2023/01/02 오전 10:54:21.197000",2005007]
[20260816,"2026-08-16",202608,"N","2023/01/02 오전 10:54:21.197000",2005007]
[20260822,"2026-08-22",202608,"N","2023/01/02 오전 10:54:21.197000",2005007]
[20260823,"2026-08-23",202608,"N","2023/01/02 오전 10:54:21.197000",2005007]
[20260829,"2026-08-29",202608,"N","2023/01/02 오전 10:54:21.197000",2005007]
[20260830,{"$f":"DATE(LEFT(A260,4),MID(A260,5,2),RIGHT(A260,2))","v":"2026-08-30"},202608,"N","2023/01/02 오전 10:54:21.197000",2005007]
[20260905,"2026-09-05",202609,"N","2023/01/02 오전 10:54:21.197000",2005007]
[20260906,"2026-09-06",202609,"N","2023/01/02 오전 10:54:21.197000",2005007]
[20260912,"2026-09-12",202609,"N","2023/01/02 오전 10:54:21.197000",2005007]
[20260913,"2026-09-13",202609,"N","2023/01/02 오전 10:54:21.197000",2005007]
[20260919,"2026-09-19",202609,"N","2023/01/02 오전 10:54:21.197000",2005007]
[20260920,"2026-09-20",202609,"N","2023/01/02 오전 10:54:21.197000",2005007]
[20260924,"2026-09-24",202609,"N","2023/01/02 오전 10:54:21.197000",2005007]
[20260925,"2026-09-25",202609,"N","2023/01/02 오전 10:54:21.197000",2005007]
[20260926,"2026-09-26",202609,"N","2023/01/02 오전 10:54:21.197000",2005007]
[20260927,"2026-09-27",202609,"N","2023/01/02 오전 10:54:21.197000",2005007]
[20261003,"2026-10-03",202610,"N","2023/01/02 오전 10:54:21.197000",2005007]
[20261004,"2026-10-04",202610,"N","2023/01/02 오전 10:54:21.197000",2005007]
[20261009,"2026-10-09",202610,"N","2023/01/02 오전 10:54:21.197000",2005007]
[20261010,"2026-10-10",202610,"N","2023/01/02 오전 10:54:21.197000",2005007]
[20261011,"2026-10-11",202610,"N","2023/01/02 오전 10:54:21.197000",2005007]
[20261017,"2026-10-17",202610,"N","2023/01/02 오전 10:54:21.197000",2005007]
[20261018,"2026-10-18",202610,"N","2023/01/02 오전 10:54:21.197000",2005007]
[20261024,"2026-10-24",202610,"N","2023/01/02 오전 10:54:21.197000",2005007]
[20261025,"2026-10-25",202610,"N","2023/01/02 오전 10:54:21.197000",2005007]
[20261031,"2026-10-31",202610,"N","2023/01/02 오전 10:54:21.197000",2005007]
[20261101,"2026-11-01",202611,"N","2023/01/02 오전 10:54:21.197000",2005007]
[20261107,"2026-11-07",202611,"N","2023/01/02 오전 10:54:21.197000",2005007]
[20261108,"2026-11-08",202611,"N","2023/01/02 오전 10:54:21.197000",2005007]
[20261114,"2026-11-14",202611,"N","2023/01/02 오전 10:54:21.197000",2005007]
[20261115,"2026-11-15",202611,"N","2023/01/02 오전 10:54:21.197000",2005007]
[20261121,"2026-11-21",202611,"N","2023/01/02 오전 10:54:21.197000",2005007]
[20261122,"2026-11-22",202611,"N","2023/01/02 오전 10:54:21.197000",2005007]
[20261128,"2026-11-28",202611,"N","2023/01/02 오전 10:54:21.197000",2005007]
[20261129,"2026-11-29",202611,"N","2023/01/02 오전 10:54:21.197000",2005007]
[20261205,"2026-12-05",202612,"N","2023/01/02 오전 10:54:21.197000",2005007]
[20261206,"2026-12-06",202612,"N","2023/01/02 오전 10:54:21.197000",2005007]
[20261212,"2026-12-12",202612,"N","2023/01/02 오전 10:54:21.197000",2005007]
[20261213,"2026-12-13",202612,"N","2023/01/02 오전 10:54:21.197000",2005007]
[20261219,"2026-12-19",202612,"N","2023/01/02 오전 10:54:21.197000",2005007]
[20261220,"2026-12-20",202612,"N","2023/01/02 오전 10:54:21.197000",2005007]
[20261225,"2026-12-25",202612,"N","2023/01/02 오전 10:54:21.197000",2005007]
[20261226,"2026-12-26",202612,"N","2023/01/02 오전 10:54:21.197000",2005007]
[20261227,"2026-12-27",202612,"N","2023/01/02 오전 10:54:21.197000",2005007]
[20270101,"2027-01-01",202701,"N","2024/03/06 오후 16:31:07.433000",2003029]
[20270102,"2027-01-02",202701,"N","2024/03/06 오후 16:31:07.433000",2003029]
[20270103,"2027-01-03",202701,"N","2024/03/06 오후 16:31:07.433000",2003029]
[20270109,"2027-01-09",202701,"N","2024/03/06 오후 16:31:07.433000",2003029]
[20270110,"2027-01-10",202701,"N","2024/03/06 오후 16:31:07.433000",2003029]
[20270116,"2027-01-16",202701,"N","2024/03/06 오후 16:31:07.433000",2003029]
[20270117,"2027-01-17",202701,"N","2024/03/06 오후 16:31:07.433000",2003029]
[20270123,"2027-01-23",202701,"N","2024/03/06 오후 16:31:07.433000",2003029]
[20270124,"2027-01-24",202701,"N","2024/03/06 오후 16:31:07.433000",2003029]
[20270130,"2027-01-30",202701,"N","2024/03/06 오후 16:31:07.433000",2003029]
[20270131,"2027-01-31",202701,"N","2024/03/06 오후 16:31:07.433000",2003029]
[20270206,"2027-02-06",202702,"N","2024/03/06 오후 16:31:07.433000",2003029]
[20270207,"2027-02-07",202702,"N","2024/03/06 오후 16:31:07.433000",2003029]
[20270208,"2027-02-08",202702,"N","2024/03/06 오후 16:31:07.433000",2003029]
[20270213,"2027-02-13",202702,"N","2024/03/06 오후 16:31:07.433000",2003029]
[20270214,"2027-02-14",202702,"N","2024/03/06 오후 16:31:07.433000",2003029]
[20270220,"2027-02-20",202702,"N","2024/03/06 오후 16:31:07.433000",2003029]
[20270221,"2027-02-21",202702,"N","2024/03/06 오후 16:31:07.433000",2003029]
[20270227,"2027-02-27",202702,"N","2024/03/06 오후 16:31:07.433000",2003029]
[20270228,"2027-02-28",202702,"N","2024/03/06 오후 16:31:07.433000",2003029]
[20270301,"2027-03-01",202703,"N","2024/03/06 오후 16:31:07.433000",2003029]
[20270306,"2027-03-06",202703,"N","2024/03/06 오후 16:31:07.433000",2003029]
[20270307,"2027-03-07",202703,"N","2024/03/06 오후 16:31:07.433000",2003029]
[20270313,"2027-03-13",202703,"N","2024/03/06 오후 16:31:07.433000",2003029]
[20270314,"2027-03-14",202703,"N","2024/03/06 오후 16:31:07.433000",2003029]
[20270320,{"$f":"DATE(LEFT(A324,4),MID(A324,5,2),RIGHT(A324,2))","v":"2027-03-20"},202703,"N","2024/03/06 오후 16:31:07.433000",2003029]
[20270321,"2027-03-21",202703,"N","2024/03/06 오후 16:31:07.433000",2003029]
[20270327,"2027-03-27",202703,"N","2024/03/06 오후 16:31:07.433000",2003029]
[20270328,"2027-03-28",202703,"N","2024/03/06 오후 16:31:07.433000",2003029]
[20270403,"2027-04-03",202704,"N","2024/03/06 오후 16:31:07.433000",2003029]
[20270404,"2027-04-04",202704,"N","2024/03/06 오후 16:31:07.433000",2003029]
[20270410,"2027-04-10",202704,"N","2024/03/06 오후 16:31:07.433000",2003029]
[20270411,"2027-04-11",202704,"N","2024/03/06 오후 16:31:07.433000",2003029]
[20270417,"2027-04-17",202704,"N","2024/03/06 오후 16:31:07.433000",2003029]
[20270418,"2027-04-18",202704,"N","2024/03/06 오후 16:31:07.433000",2003029]
[20270424,"2027-04-24",202704,"N","2024/03/06 오후 16:31:07.433000",2003029]
[20270425,"2027-04-25",202704,"N","2024/03/06 오후 16:31:07.433000",2003029]
[20270501,"2027-05-01",202705,"N","2024/03/06 오후 16:31:07.433000",2003029]
[20270502,"2027-05-02",202705,"N","2024/03/06 오후 16:31:07.433000",2003029]
[20270505,"2027-05-05",202705,"N","2024/03/06 오후 16:31:07.433000",2003029]
[20270508,"2027-05-08",202705,"N","2024/03/06 오후 16:31:07.433000",2003029]
[20270509,"2027-05-09",202705,"N","2024/03/06 오후 16:31:07.433000",2003029]
[20270513,"2027-05-13",202705,"N","2024/03/06 오후 16:31:07.433000",2003029]
[20270515,"2027-05-15",202705,"N","2024/03/06 오후 16:31:07.433000",2003029]
[20270516,"2027-05-16",202705,"N","2024/03/06 오후 16:31:07.433000",2003029]
[20270522,"2027-05-22",202705,"N","2024/03/06 오후 16:31:07.433000",2003029]
[20270523,"2027-05-23",202705,"N","2024/03/06 오후 16:31:07.433000",2003029]
[20270529,"2027-05-29",202705,"N","2024/03/06 오후 16:31:07.433000",2003029]
[20270530,"2027-05-30",202705,"N","2024/03/06 오후 16:31:07.433000",2003029]
[20270605,"2027-06-05",202706,"N","2024/03/06 오후 16:31:07.433000",2003029]
[20270606,"2027-06-06",202706,"N","2024/03/06 오후 16:31:07.433000",2003029]
[20270612,"2027-06-12",202706,"N","2024/03/06 오후 16:31:07.433000",2003029]
[20270613,"2027-06-13",202706,"N","2024/03/06 오후 16:31:07.433000",2003029]
[20270619,"2027-06-19",202706,"N","2024/03/06 오후 16:31:07.433000",2003029]
[20270620,"2027-06-20",202706,"N","2024/03/06 오후 16:31:07.433000",2003029]
[20270626,"2027-06-26",202706,"N","2024/03/06 오후 16:31:07.433000",2003029]
[20270627,"2027-06-27",202706,"N","2024/03/06 오후 16:31:07.433000",2003029]
[20270703,"2027-07-03",202707,"N","2024/03/06 오후 16:31:07.433000",2003029]
[20270704,"2027-07-04",202707,"N","2024/03/06 오후 16:31:07.433000",2003029]
[20270710,"2027-07-10",202707,"N","2024/03/06 오후 16:31:07.433000",2003029]
[20270711,"2027-07-11",202707,"N","2024/03/06 오후 16:31:07.433000",2003029]
[20270717,"2027-07-17",202707,"N","2024/03/06 오후 16:31:07.433000",2003029]
[20270718,"2027-07-18",202707,"N","2024/03/06 오후 16:31:07.433000",2003029]
[20270724,"2027-07-24",202707,"N","2024/03/06 오후 16:31:07.433000",2003029]
[20270725,"2027-07-25",202707,"N","2024/03/06 오후 16:31:07.433000",2003029]
[20270731,"2027-07-31",202707,"N","2024/03/06 오후 16:31:07.433000",2003029]
[20270801,"2027-08-01",202708,"N","2024/03/06 오후 16:31:07.433000",2003029]
[20270807,"2027-08-07",202708,"N","2024/03/06 오후 16:31:07.433000",2003029]
[20270808,"2027-08-08",202708,"N","2024/03/06 오후 16:31:07.433000",2003029]
[20270814,"2027-08-14",202708,"N","2024/03/06 오후 16:31:07.433000",2003029]
[20270815,"2027-08-15",202708,"N","2024/03/06 오후 16:31:07.433000",2003029]
[20270821,"2027-08-21",202708,"N","2024/03/06 오후 16:31:07.433000",2003029]
[20270822,"2027-08-22",202708,"N","2024/03/06 오후 16:31:07.433000",2003029]
[20270828,"2027-08-28",202708,"N","2024/03/06 오후 16:31:07.433000",2003029]
[20270829,"2027-08-29",202708,"N","2024/03/06 오후 16:31:07.433000",2003029]
[20270904,"2027-09-04",202709,"N","2024/03/06 오후 16:31:07.433000",2003029]
[20270905,"2027-09-05",202709,"N","2024/03/06 오후 16:31:07.433000",2003029]
[20270911,"2027-09-11",202709,"N","2024/03/06 오후 16:31:07.433000",2003029]
[20270912,"2027-09-12",202709,"N","2024/03/06 오후 16:31:07.433000",2003029]
[20270914,"2027-09-14",202709,"N","2024/03/06 오후 16:31:07.433000",2003029]
[20270915,"2027-09-15",202709,"N","2024/03/06 오후 16:31:07.433000",2003029]
[20270916,"2027-09-16",202709,"N","2024/03/06 오후 16:31:07.433000",2003029]
[20270918,"2027-09-18",202709,"N","2024/03/06 오후 16:31:07.433000",2003029]
[20270919,"2027-09-19",202709,"N","2024/03/06 오후 16:31:07.433000",2003029]
[20270925,"2027-09-25",202709,"N","2024/03/06 오후 16:31:07.433000",2003029]
[20270926,"2027-09-26",202709,"N","2024/03/06 오후 16:31:07.433000",2003029]
[20271002,"2027-10-02",202710,"N","2024/03/06 오후 16:31:07.433000",2003029]
[20271003,"2027-10-03",202710,"N","2024/03/06 오후 16:31:07.433000",2003029]
[20271009,"2027-10-09",202710,"N","2024/03/06 오후 16:31:07.433000",2003029]
[20271010,{"$f":"DATE(LEFT(A388,4),MID(A388,5,2),RIGHT(A388,2))","v":"2027-10-10"},202710,"N","2024/03/06 오후 16:31:07.433000",2003029]
[20271016,"2027-10-16",202710,"N","2024/03/06 오후 16:31:07.433000",2003029]
[20271017,"2027-10-17",202710,"N","2024/03/06 오후 16:31:07.433000",2003029]
[20271023,"2027-10-23",202710,"N","2024/03/06 오후 16:31:07.433000",2003029]
[20271024,"2027-10-24",202710,"N","2024/03/06 오후 16:31:07.433000",2003029]
[20271030,"2027-10-30",202710,"N","2024/03/06 오후 16:31:07.433000",2003029]
[20271031,"2027-10-31",202710,"N","2024/03/06 오후 16:31:07.433000",2003029]
[20271106,"2027-11-06",202711,"N","2024/03/06 오후 16:31:07.433000",2003029]
[20271107,"2027-11-07",202711,"N","2024/03/06 오후 16:31:07.433000",2003029]
[20271113,"2027-11-13",202711,"N","2024/03/06 오후 16:31:07.433000",2003029]
[20271114,"2027-11-14",202711,"N","2024/03/06 오후 16:31:07.433000",2003029]
[20271120,"2027-11-20",202711,"N","2024/03/06 오후 16:31:07.433000",2003029]
[20271121,"2027-11-21",202711,"N","2024/03/06 오후 16:31:07.433000",2003029]
[20271127,"2027-11-27",202711,"N","2024/03/06 오후 16:31:07.433000",2003029]
[20271128,"2027-11-28",202711,"N","2024/03/06 오후 16:31:07.433000",2003029]
[20271204,"2027-12-04",202712,"N","2024/03/06 오후 16:31:07.433000",2003029]
[20271205,"2027-12-05",202712,"N","2024/03/06 오후 16:31:07.433000",2003029]
[20271211,"2027-12-11",202712,"N","2024/03/06 오후 16:31:07.433000",2003029]
[20271212,"2027-12-12",202712,"N","2024/03/06 오후 16:31:07.433000",2003029]
[20271218,"2027-12-18",202712,"N","2024/03/06 오후 16:31:07.433000",2003029]
[20271219,"2027-12-19",202712,"N","2024/03/06 오후 16:31:07.433000",2003029]
[20271225,"2027-12-25",202712,"N","2024/03/06 오후 16:31:07.433000",2003029]
[20271226,"2027-12-26",202712,"N","2024/03/06 오후 16:31:07.433000",2003029]
[20280101,"2028-01-01",202801,"N","2024/03/06 오후 16:31:27.979000",2003029]
[20280102,"2028-01-02",202801,"N","2024/03/06 오후 16:31:27.979000",2003029]
[20280108,"2028-01-08",202801,"N","2024/03/06 오후 16:31:27.979000",2003029]
[20280109,"2028-01-09",202801,"N","2024/03/06 오후 16:31:27.979000",2003029]
[20280115,"2028-01-15",202801,"N","2024/03/06 오후 16:31:27.979000",2003029]
[20280116,"2028-01-16",202801,"N","2024/03/06 오후 16:31:27.979000",2003029]
[20280122,"2028-01-22",202801,"N","2024/03/06 오후 16:31:27.979000",2003029]
[20280123,"2028-01-23",202801,"N","2024/03/06 오후 16:31:27.979000",2003029]
[20280126,"2028-01-26",202801,"N","2024/03/06 오후 16:31:27.979000",2003029]
[20280127,"2028-01-27",202801,"N","2024/03/06 오후 16:31:27.979000",2003029]
[20280128,"2028-01-28",202801,"N","2024/03/06 오후 16:31:27.979000",2003029]
[20280129,"2028-01-29",202801,"N","2024/03/06 오후 16:31:27.979000",2003029]
[20280130,"2028-01-30",202801,"N","2024/03/06 오후 16:31:27.979000",2003029]
[20280205,"2028-02-05",202802,"N","2024/03/06 오후 16:31:27.979000",2003029]
[20280206,"2028-02-06",202802,"N","2024/03/06 오후 16:31:27.979000",2003029]
[20280212,"2028-02-12",202802,"N","2024/03/06 오후 16:31:27.979000",2003029]
[20280213,"2028-02-13",202802,"N","2024/03/06 오후 16:31:27.979000",2003029]
[20280219,"2028-02-19",202802,"N","2024/03/06 오후 16:31:27.979000",2003029]
[20280220,"2028-02-20",202802,"N","2024/03/06 오후 16:31:27.979000",2003029]
[20280226,"2028-02-26",202802,"N","2024/03/06 오후 16:31:27.979000",2003029]
[20280227,"2028-02-27",202802,"N","2024/03/06 오후 16:31:27.979000",2003029]
[20280301,"2028-03-01",202803,"N","2024/03/06 오후 16:31:27.979000",2003029]
[20280304,"2028-03-04",202803,"N","2024/03/06 오후 16:31:27.979000",2003029]
[20280305,"2028-03-05",202803,"N","2024/03/06 오후 16:31:27.979000",2003029]
[20280311,"2028-03-11",202803,"N","2024/03/06 오후 16:31:27.979000",2003029]
[20280312,"2028-03-12",202803,"N","2024/03/06 오후 16:31:27.979000",2003029]
[20280318,"2028-03-18",202803,"N","2024/03/06 오후 16:31:27.979000",2003029]
[20280319,"2028-03-19",202803,"N","2024/03/06 오후 16:31:27.979000",2003029]
[20280325,"2028-03-25",202803,"N","2024/03/06 오후 16:31:27.979000",2003029]
[20280326,"2028-03-26",202803,"N","2024/03/06 오후 16:31:27.979000",2003029]
[20280401,"2028-04-01",202804,"N","2024/03/06 오후 16:31:27.979000",2003029]
[20280402,"2028-04-02",202804,"N","2024/03/06 오후 16:31:27.979000",2003029]
[20280408,"2028-04-08",202804,"N","2024/03/06 오후 16:31:27.979000",2003029]
[20280409,"2028-04-09",202804,"N","2024/03/06 오후 16:31:27.979000",2003029]
[20280415,"2028-04-15",202804,"N","2024/03/06 오후 16:31:27.979000",2003029]
[20280416,"2028-04-16",202804,"N","2024/03/06 오후 16:31:27.979000",2003029]
[20280422,"2028-04-22",202804,"N","2024/03/06 오후 16:31:27.979000",2003029]
[20280423,"2028-04-23",202804,"N","2024/03/06 오후 16:31:27.979000",2003029]
[20280429,"2028-04-29",202804,"N","2024/03/06 오후 16:31:27.979000",2003029]
[20280430,"2028-04-30",202804,"N","2024/03/06 오후 16:31:27.979000",2003029]
[20280501,"2028-05-01",202805,"N","2024/03/14 오후 16:34:56.465000",2007006]
[20280502,{"$f":"DATE(LEFT(A452,4),MID(A452,5,2),RIGHT(A452,2))","v":"2028-05-02"},202805,"N","2024/03/14 오후 16:34:56.465000",2007006]
[20280505,"2028-05-05",202805,"N","2024/03/14 오후 16:34:56.465000",2007006]
[20280506,"2028-05-06",202805,"N","2024/03/14 오후 16:34:56.465000",2007006]
[20280507,"2028-05-07",202805,"N","2024/03/14 오후 16:34:56.465000",2007006]
[20280513,"2028-05-13",202805,"N","2024/03/14 오후 16:34:56.465000",2007006]
[20280514,"2028-05-14",202805,"N","2024/03/14 오후 16:34:56.465000",2007006]
[20280520,"2028-05-20",202805,"N","2024/03/14 오후 16:34:56.465000",2007006]
[20280521,"2028-05-21",202805,"N","2024/03/14 오후 16:34:56.465000",2007006]
[20280527,"2028-05-27",202805,"N","2024/03/14 오후 16:34:56.465000",2007006]
[20280528,"2028-05-28",202805,"N","2024/03/14 오후 16:34:56.465000",2007006]
[20280603,"2028-06-03",202806,"N","2024/03/06 오후 16:31:27.979000",2003029]
[20280604,"2028-06-04",202806,"N","2024/03/06 오후 16:31:27.979000",2003029]
[20280606,"2028-06-06",202806,"N","2024/03/06 오후 16:31:27.979000",2003029]
[20280610,"2028-06-10",202806,"N","2024/03/06 오후 16:31:27.979000",2003029]
[20280611,"2028-06-11",202806,"N","2024/03/06 오후 16:31:27.979000",2003029]
[20280617,"2028-06-17",202806,"N","2024/03/06 오후 16:31:27.979000",2003029]
[20280618,"2028-06-18",202806,"N","2024/03/06 오후 16:31:27.979000",2003029]
[20280624,"2028-06-24",202806,"N","2024/03/06 오후 16:31:27.979000",2003029]
[20280625,"2028-06-25",202806,"N","2024/03/06 오후 16:31:27.979000",2003029]
[20280701,"2028-07-01",202807,"N","2024/03/06 오후 16:31:27.979000",2003029]
[20280702,"2028-07-02",202807,"N","2024/03/06 오후 16:31:27.979000",2003029]
[20280708,"2028-07-08",202807,"N","2024/03/06 오후 16:31:27.979000",2003029]
[20280709,"2028-07-09",202807,"N","2024/03/06 오후 16:31:27.979000",2003029]
[20280715,"2028-07-15",202807,"N","2024/03/06 오후 16:31:27.979000",2003029]
[20280716,"2028-07-16",202807,"N","2024/03/06 오후 16:31:27.979000",2003029]
[20280722,"2028-07-22",202807,"N","2024/03/06 오후 16:31:27.979000",2003029]
[20280723,"2028-07-23",202807,"N","2024/03/06 오후 16:31:27.979000",2003029]
[20280729,"2028-07-29",202807,"N","2024/03/06 오후 16:31:27.979000",2003029]
[20280730,"2028-07-30",202807,"N","2024/03/06 오후 16:31:27.979000",2003029]
[20280805,"2028-08-05",202808,"N","2024/03/06 오후 16:31:27.979000",2003029]
[20280806,"2028-08-06",202808,"N","2024/03/06 오후 16:31:27.979000",2003029]
[20280812,"2028-08-12",202808,"N","2024/03/06 오후 16:31:27.979000",2003029]
[20280813,"2028-08-13",202808,"N","2024/03/06 오후 16:31:27.979000",2003029]
[20280815,"2028-08-15",202808,"N","2024/03/06 오후 16:31:27.979000",2003029]
[20280819,"2028-08-19",202808,"N","2024/03/06 오후 16:31:27.979000",2003029]
[20280820,"2028-08-20",202808,"N","2024/03/06 오후 16:31:27.979000",2003029]
[20280826,"2028-08-26",202808,"N","2024/03/06 오후 16:31:27.979000",2003029]
[20280827,"2028-08-27",202808,"N","2024/03/06 오후 16:31:27.979000",2003029]
[20280902,"2028-09-02",202809,"N","2024/03/06 오후 16:31:27.979000",2003029]
[20280903,"2028-09-03",202809,"N","2024/03/06 오후 16:31:27.979000",2003029]
[20280909,"2028-09-09",202809,"N","2024/03/06 오후 16:31:27.979000",2003029]
[20280910,"2028-09-10",202809,"N","2024/03/06 오후 16:31:27.979000",2003029]
[20280916,"2028-09-16",202809,"N","2024/03/06 오후 16:31:27.979000",2003029]
[20280917,"2028-09-17",202809,"N","2024/03/06 오후 16:31:27.979000",2003029]
[20280923,"2028-09-23",202809,"N","2024/03/06 오후 16:31:27.979000",2003029]
[20280924,"2028-09-24",202809,"N","2024/03/06 오후 16:31:27.979000",2003029]
[20280930,"2028-09-30",202809,"N","2024/03/06 오후 16:31:27.979000",2003029]
[20281001,"2028-10-01",202810,"N","2024/03/06 오후 16:31:27.979000",2003029]
[20281002,"2028-10-02",202810,"N","2024/03/06 오후 16:31:27.979000",2003029]
[20281003,"2028-10-03",202810,"N","2024/03/06 오후 16:31:27.979000",2003029]
[20281004,"2028-10-04",202810,"N","2024/03/06 오후 16:31:27.979000",2003029]
[20281007,"2028-10-07",202810,"N","2024/03/06 오후 16:31:27.979000",2003029]
[20281008,"2028-10-08",202810,"N","2024/03/06 오후 16:31:27.979000",2003029]
[20281009,"2028-10-09",202810,"N","2024/03/06 오후 16:31:27.979000",2003029]
[20281014,"2028-10-14",202810,"N","2024/03/06 오후 16:31:27.979000",2003029]
[20281015,"2028-10-15",202810,"N","2024/03/06 오후 16:31:27.979000",2003029]
[20281021,"2028-10-21",202810,"N","2024/03/06 오후 16:31:27.979000",2003029]
[20281022,"2028-10-22",202810,"N","2024/03/06 오후 16:31:27.979000",2003029]
[20281028,"2028-10-28",202810,"N","2024/03/06 오후 16:31:27.979000",2003029]
[20281029,"2028-10-29",202810,"N","2024/03/06 오후 16:31:27.979000",2003029]
[20281104,"2028-11-04",202811,"N","2024/03/06 오후 16:31:27.979000",2003029]
[20281105,"2028-11-05",202811,"N","2024/03/06 오후 16:31:27.979000",2003029]
[20281111,"2028-11-11",202811,"N","2024/03/06 오후 16:31:27.979000",2003029]
[20281112,"2028-11-12",202811,"N","2024/03/06 오후 16:31:27.979000",2003029]
[20281118,{"$f":"DATE(LEFT(A516,4),MID(A516,5,2),RIGHT(A516,2))","v":"2028-11-18"},202811,"N","2024/03/06 오후 16:31:27.979000",2003029]
[20281119,"2028-11-19",202811,"N","2024/03/06 오후 16:31:27.979000",2003029]
[20281125,"2028-11-25",202811,"N","2024/03/06 오후 16:31:27.979000",2003029]
[20281126,"2028-11-26",202811,"N","2024/03/06 오후 16:31:27.979000",2003029]
[20281202,"2028-12-02",202812,"N","2024/03/06 오후 16:31:27.979000",2003029]
[20281203,"2028-12-03",202812,"N","2024/03/06 오후 16:31:27.979000",2003029]
[20281209,"2028-12-09",202812,"N","2024/03/06 오후 16:31:27.979000",2003029]
[20281210,"2028-12-10",202812,"N","2024/03/06 오후 16:31:27.979000",2003029]
[20281216,"2028-12-16",202812,"N","2024/03/06 오후 16:31:27.979000",2003029]
[20281217,"2028-12-17",202812,"N","2024/03/06 오후 16:31:27.979000",2003029]
[20281223,"2028-12-23",202812,"N","2024/03/06 오후 16:31:27.979000",2003029]
[20281224,"2028-12-24",202812,"N","2024/03/06 오후 16:31:27.979000",2003029]
[20281225,"2028-12-25",202812,"N","2024/03/06 오후 16:31:27.979000",2003029]
[20281230,"2028-12-30",202812,"N","2024/03/06 오후 16:31:27.979000",2003029]
[20281231,"2028-12-31",202812,"N","2024/03/06 오후 16:31:27.979000",2003029]
[20290101,"2029-01-01",202901,"N","2024/03/14 오후 16:34:26.077000",2007006]
[20290106,"2029-01-06",202901,"N","2024/03/14 오후 16:34:26.077000",2007006]
[20290107,"2029-01-07",202901,"N","2024/03/14 오후 16:34:26.077000",2007006]
[20290113,"2029-01-13",202901,"N","2024/03/14 오후 16:34:26.077000",2007006]
[20290114,"2029-01-14",202901,"N","2024/03/14 오후 16:34:26.077000",2007006]
[20290120,"2029-01-20",202901,"N","2024/03/14 오후 16:34:26.077000",2007006]
[20290121,"2029-01-21",202901,"N","2024/03/14 오후 16:34:26.077000",2007006]
[20290127,"2029-01-27",202901,"N","2024/03/14 오후 16:34:26.077000",2007006]
[20290128,"2029-01-28",202901,"N","2024/03/14 오후 16:34:26.077000",2007006]
[20290203,"2029-02-03",202902,"N","2024/03/14 오후 16:34:26.077000",2007006]
[20290204,"2029-02-04",202902,"N","2024/03/14 오후 16:34:26.077000",2007006]
[20290210,"2029-02-10",202902,"N","2024/03/14 오후 16:34:26.077000",2007006]
[20290211,"2029-02-11",202902,"N","2024/03/14 오후 16:34:26.077000",2007006]
[20290213,"2029-02-13",202902,"N","2024/03/14 오후 16:34:26.077000",2007006]
[20290214,"2029-02-14",202902,"N","2024/03/14 오후 16:34:26.077000",2007006]
[20290217,"2029-02-17",202902,"N","2024/03/14 오후 16:34:26.077000",2007006]
[20290218,"2029-02-18",202902,"N","2024/03/14 오후 16:34:26.077000",2007006]
[20290224,"2029-02-24",202902,"N","2024/03/14 오후 16:34:26.077000",2007006]
[20290225,"2029-02-25",202902,"N","2024/03/14 오후 16:34:26.077000",2007006]
[20290301,"2029-03-01",202903,"N","2024/03/14 오후 16:34:26.077000",2007006]
[20290303,"2029-03-03",202903,"N","2024/03/14 오후 16:34:26.077000",2007006]
[20290304,"2029-03-04",202903,"N","2024/03/14 오후 16:34:26.077000",2007006]
[20290310,"2029-03-10",202903,"N","2024/03/14 오후 16:34:26.077000",2007006]
[20290311,"2029-03-11",202903,"N","2024/03/14 오후 16:34:26.077000",2007006]
[20290317,"2029-03-17",202903,"N","2024/03/14 오후 16:34:26.077000",2007006]
[20290318,"2029-03-18",202903,"N","2024/03/14 오후 16:34:26.077000",2007006]
[20290324,"2029-03-24",202903,"N","2024/03/14 오후 16:34:26.077000",2007006]
[20290325,"2029-03-25",202903,"N","2024/03/14 오후 16:34:26.077000",2007006]
[20290331,"2029-03-31",202903,"N","2024/03/14 오후 16:34:26.077000",2007006]
[20290401,"2029-04-01",202904,"N","2024/03/14 오후 16:34:26.077000",2007006]
[20290407,"2029-04-07",202904,"N","2024/03/14 오후 16:34:26.077000",2007006]
[20290408,"2029-04-08",202904,"N","2024/03/14 오후 16:34:26.077000",2007006]
[20290414,"2029-04-14",202904,"N","2024/03/14 오후 16:34:26.077000",2007006]
[20290415,"2029-04-15",202904,"N","2024/03/14 오후 16:34:26.077000",2007006]
[20290421,"2029-04-21",202904,"N","2024/03/14 오후 16:34:26.077000",2007006]
[20290422,"2029-04-22",202904,"N","2024/03/14 오후 16:34:26.077000",2007006]
[20290428,"2029-04-28",202904,"N","2024/03/14 오후 16:34:26.077000",2007006]
[20290429,"2029-04-29",202904,"N","2024/03/14 오후 16:34:26.077000",2007006]
[20290501,"2029-05-01",202905,"N","2024/03/14 오후 16:34:34.937000",2007006]
[20290505,"2029-05-05",202905,"N","2024/03/14 오후 16:34:34.937000",2007006]
[20290506,"2029-05-06",202905,"N","2024/03/14 오후 16:34:34.937000",2007006]
[20290512,"2029-05-12",202905,"N","2024/03/14 오후 16:34:34.937000",2007006]
[20290513,"2029-05-13",202905,"N","2024/03/14 오후 16:34:34.937000",2007006]
[20290519,"2029-05-19",202905,"N","2024/03/14 오후 16:34:34.937000",2007006]
[20290520,"2029-05-20",202905,"N","2024/03/14 오후 16:34:34.937000",2007006]
[20290526,"2029-05-26",202905,"N","2024/03/14 오후 16:34:34.937000",2007006]
[20290527,"2029-05-27",202905,"N","2024/03/14 오후 16:34:34.937000",2007006]
[20290602,"2029-06-02",202906,"N","2024/03/14 오후 16:34:26.077000",2007006]
[20290603,"2029-06-03",202906,"N","2024/03/14 오후 16:34:26.077000",2007006]
[20290606,{"$f":"DATE(LEFT(A580,4),MID(A580,5,2),RIGHT(A580,2))","v":"2029-06-06"},202906,"N","2024/03/14 오후 16:34:26.077000",2007006]
[20290609,"2029-06-09",202906,"N","2024/03/14 오후 16:34:26.077000",2007006]
[20290610,"2029-06-10",202906,"N","2024/03/14 오후 16:34:26.077000",2007006]
[20290616,"2029-06-16",202906,"N","2024/03/14 오후 16:34:26.077000",2007006]
[20290617,"2029-06-17",202906,"N","2024/03/14 오후 16:34:26.077000",2007006]
[20290623,"2029-06-23",202906,"N","2024/03/14 오후 16:34:26.077000",2007006]
[20290624,"2029-06-24",202906,"N","2024/03/14 오후 16:34:26.077000",2007006]
[20290630,"2029-06-30",202906,"N","2024/03/14 오후 16:34:26.077000",2007006]
[20290701,"2029-07-01",202907,"N","2024/03/14 오후 16:34:26.077000",2007006]
[20290707,"2029-07-07",202907,"N","2024/03/14 오후 16:34:26.077000",2007006]
[20290708,"2029-07-08",202907,"N","2024/03/14 오후 16:34:26.077000",2007006]
[20290714,"2029-07-14",202907,"N","2024/03/14 오후 16:34:26.077000",2007006]
[20290715,"2029-07-15",202907,"N","2024/03/14 오후 16:34:26.077000",2007006]
[20290721,"2029-07-21",202907,"N","2024/03/14 오후 16:34:26.077000",2007006]
[20290722,"2029-07-22",202907,"N","2024/03/14 오후 16:34:26.077000",2007006]
[20290728,"2029-07-28",202907,"N","2024/03/14 오후 16:34:26.077000",2007006]
[20290729,"2029-07-29",202907,"N","2024/03/14 오후 16:34:26.077000",2007006]
[20290804,"2029-08-04",202908,"N","2024/03/14 오후 16:34:26.077000",2007006]
[20290805,"2029-08-05",202908,"N","2024/03/14 오후 16:34:26.077000",2007006]
[20290811,"2029-08-11",202908,"N","2024/03/14 오후 16:34:26.077000",2007006]
[20290812,"2029-08-12",202908,"N","2024/03/14 오후 16:34:26.077000",2007006]
[20290815,"2029-08-15",202908,"N","2024/03/14 오후 16:34:26.077000",2007006]
[20290818,"2029-08-18",202908,"N","2024/03/14 오후 16:34:26.077000",2007006]
[20290819,"2029-08-19",202908,"N","2024/03/14 오후 16:34:26.077000",2007006]
[20290825,"2029-08-25",202908,"N","2024/03/14 오후 16:34:26.077000",2007006]
[20290826,"2029-08-26",202908,"N","2024/03/14 오후 16:34:26.077000",2007006]
[20290901,"2029-09-01",202909,"N","2024/03/14 오후 16:34:26.077000",2007006]
[20290902,"2029-09-02",202909,"N","2024/03/14 오후 16:34:26.077000",2007006]
[20290908,"2029-09-08",202909,"N","2024/03/14 오후 16:34:26.077000",2007006]
[20290909,"2029-09-09",202909,"N","2024/03/14 오후 16:34:26.077000",2007006]
[20290915,"2029-09-15",202909,"N","2024/03/14 오후 16:34:26.077000",2007006]
[20290916,"2029-09-16",202909,"N","2024/03/14 오후 16:34:26.077000",2007006]
[20290921,"2029-09-21",202909,"N","2024/03/14 오후 16:34:26.077000",2007006]
[20290922,"2029-09-22",202909,"N","2024/03/14 오후 16:34:26.077000",2007006]
[20290923,"2029-09-23",202909,"N","2024/03/14 오후 16:34:26.077000",2007006]
[20290929,"2029-09-29",202909,"N","2024/03/14 오후 16:34:26.077000",2007006]
[20290930,"2029-09-30",202909,"N","2024/03/14 오후 16:34:26.077000",2007006]
[20291003,"2029-10-03",202910,"N","2024/03/14 오후 16:34:26.077000",2007006]
[20291006,"2029-10-06",202910,"N","2024/03/14 오후 16:34:26.077000",2007006]
[20291007,"2029-10-07",202910,"N","2024/03/14 오후 16:34:26.077000",2007006]
[20291009,"2029-10-09",202910,"N","2024/03/14 오후 16:34:26.077000",2007006]
[20291013,"2029-10-13",202910,"N","2024/03/14 오후 16:34:26.077000",2007006]
[20291014,"2029-10-14",202910,"N","2024/03/14 오후 16:34:26.077000",2007006]
[20291020,"2029-10-20",202910,"N","2024/03/14 오후 16:34:26.077000",2007006]
[20291021,"2029-10-21",202910,"N","2024/03/14 오후 16:34:26.077000",2007006]
[20291027,"2029-10-27",202910,"N","2024/03/14 오후 16:34:26.077000",2007006]
[20291028,"2029-10-28",202910,"N","2024/03/14 오후 16:34:26.077000",2007006]
[20291103,"2029-11-03",202911,"N","2024/03/14 오후 16:34:26.077000",2007006]
[20291104,"2029-11-04",202911,"N","2024/03/14 오후 16:34:26.077000",2007006]
[20291110,"2029-11-10",202911,"N","2024/03/14 오후 16:34:26.077000",2007006]
[20291111,"2029-11-11",202911,"N","2024/03/14 오후 16:34:26.077000",2007006]
[20291117,"2029-11-17",202911,"N","2024/03/14 오후 16:34:26.077000",2007006]
[20291118,"2029-11-18",202911,"N","2024/03/14 오후 16:34:26.077000",2007006]
[20291124,"2029-11-24",202911,"N","2024/03/14 오후 16:34:26.077000",2007006]
[20291125,"2029-11-25",202911,"N","2024/03/14 오후 16:34:26.077000",2007006]
[20291201,"2029-12-01",202912,"N","2024/03/14 오후 16:34:26.077000",2007006]
[20291202,"2029-12-02",202912,"N","2024/03/14 오후 16:34:26.077000",2007006]
[20291208,"2029-12-08",202912,"N","2024/03/14 오후 16:34:26.077000",2007006]
[20291209,"2029-12-09",202912,"N","2024/03/14 오후 16:34:26.077000",2007006]
[20291215,"2029-12-15",202912,"N","2024/03/14 오후 16:34:26.077000",2007006]
[20291216,"2029-12-16",202912,"N","2024/03/14 오후 16:34:26.077000",2007006]
[20291222,"2029-12-22",202912,"N","2024/03/14 오후 16:34:26.077000",2007006]
[20291223,"2029-12-23",202912,"N","2024/03/14 오후 16:34:26.077000",2007006]
[20291225,"2029-12-25",202912,"N","2024/03/14 오후 16:34:26.077000",2007006]
[20291229,{"$f":"DATE(LEFT(A644,4),MID(A644,5,2),RIGHT(A644,2))","v":"2029-12-29"},202912,"N","2024/03/14 오후 16:34:26.077000",2007006]
[20291230,"2029-12-30",202912,"N","2024/03/14 오후 16:34:26.077000",2007006]

{"sheet":"상환일","index":2,"n_rows":29,"n_cols":21,"rows_kept":29,"cut":false,"hidden":true,"merged":[]}
[]
["승인일",{"$f":"분할상환계획표!E9","v":"2025-04-08"}]
[null,1,null,2,null,3,null,4,null,5,null,6,null,7,null,8,null,9,null,10]
[1,{"$f":"EDATE($B$2,1)","v":"2025-05-08"},{"$f":"IFERROR(VLOOKUP(B4,ZCO_BZDD!$B:$D,3,),\"Y\")","v":"Y"},{"$f":"IF(C4=\"Y\",\"\",B4+1)","v":""},{"$f":"IF(D4=\"\",\"\",IFERROR(VLOOKUP(D4,ZCO_BZDD!$B$2:$D$645,3,),\"Y\"))","v":""},{"$f":"IFERROR(IF(E4=\"Y\",\"\",D4+1),\"\")","v":""},{"$f":"IF(F4=\"\",\"\",IFERROR(VLOOKUP(F4,ZCO_BZDD!$B$2:$D$645,3,),\"Y\"))","v":""},{"$f":"IFERROR(IF(G4=\"Y\",\"\",F4+1),\"\")","v":""},{"$f":"IF(H4=\"\",\"\",IFERROR(VLOOKUP(H4,ZCO_BZDD!$B$2:$D$645,3,),\"Y\"))","v":""},{"$f":"IFERROR(IF(I4=\"Y\",\"\",H4+1),\"\")","v":""},{"$f":"IF(J4=\"\",\"\",IFERROR(VLOOKUP(J4,ZCO_BZDD!$B$2:$D$645,3,),\"Y\"))","v":""},{"$f":"IFERROR(IF(K4=\"Y\",\"\",J4+1),\"\")","v":""},{"$f":"IF(L4=\"\",\"\",IFERROR(VLOOKUP(L4,ZCO_BZDD!$B$2:$D$645,3,),\"Y\"))","v":""},{"$f":"IFERROR(IF(M4=\"Y\",\"\",L4+1),\"\")","v":""},{"$f":"IF(N4=\"\",\"\",IFERROR(VLOOKUP(N4,ZCO_BZDD!$B$2:$D$645,3,),\"Y\"))","v":""},{"$f":"IFERROR(IF(O4=\"Y\",\"\",N4+1),\"\")","v":""},{"$f":"IF(P4=\"\",\"\",IFERROR(VLOOKUP(P4,ZCO_BZDD!$B$2:$D$645,3,),\"Y\"))","v":""},{"$f":"IFERROR(IF(Q4=\"Y\",\"\",P4+1),\"\")","v":""},{"$f":"IF(R4=\"\",\"\",IFERROR(VLOOKUP(R4,ZCO_BZDD!$B$2:$D$645,3,),\"Y\"))","v":""},{"$f":"IFERROR(IF(S4=\"Y\",\"\",R4+1),\"\")","v":""},{"$f":"IF(T4=\"\",\"\",IFERROR(VLOOKUP(T4,ZCO_BZDD!$B$2:$D$645,3,),\"Y\"))","v":""}]
[2,{"$f":"EDATE($B$2,2)","v":"2025-06-08"},{"$f":"IFERROR(VLOOKUP(B5,ZCO_BZDD!$B:$D,3,),\"Y\")","v":"N"},{"$f":"IF(C5=\"Y\",\"\",B5+1)","v":"2025-06-09"},{"$f":"IF(D5=\"\",\"\",IFERROR(VLOOKUP(D5,ZCO_BZDD!$B$2:$D$645,3,),\"Y\"))","v":"Y"},{"$f":"IFERROR(IF(E5=\"Y\",\"\",D5+1),\"\")","v":""},{"$f":"IF(F5=\"\",\"\",IFERROR(VLOOKUP(F5,ZCO_BZDD!$B$2:$D$645,3,),\"Y\"))","v":""},{"$f":"IFERROR(IF(G5=\"Y\",\"\",F5+1),\"\")","v":""},{"$f":"IF(H5=\"\",\"\",IFERROR(VLOOKUP(H5,ZCO_BZDD!$B$2:$D$645,3,),\"Y\"))","v":""},{"$f":"IFERROR(IF(I5=\"Y\",\"\",H5+1),\"\")","v":""},{"$f":"IF(J5=\"\",\"\",IFERROR(VLOOKUP(J5,ZCO_BZDD!$B$2:$D$645,3,),\"Y\"))","v":""},{"$f":"IFERROR(IF(K5=\"Y\",\"\",J5+1),\"\")","v":""},{"$f":"IF(L5=\"\",\"\",IFERROR(VLOOKUP(L5,ZCO_BZDD!$B$2:$D$645,3,),\"Y\"))","v":""},{"$f":"IFERROR(IF(M5=\"Y\",\"\",L5+1),\"\")","v":""},{"$f":"IF(N5=\"\",\"\",IFERROR(VLOOKUP(N5,ZCO_BZDD!$B$2:$D$645,3,),\"Y\"))","v":""},{"$f":"IFERROR(IF(O5=\"Y\",\"\",N5+1),\"\")","v":""},{"$f":"IF(P5=\"\",\"\",IFERROR(VLOOKUP(P5,ZCO_BZDD!$B$2:$D$645,3,),\"Y\"))","v":""},{"$f":"IFERROR(IF(Q5=\"Y\",\"\",P5+1),\"\")","v":""},{"$f":"IF(R5=\"\",\"\",IFERROR(VLOOKUP(R5,ZCO_BZDD!$B$2:$D$645,3,),\"Y\"))","v":""},{"$f":"IFERROR(IF(S5=\"Y\",\"\",R5+1),\"\")","v":""},{"$f":"IF(T5=\"\",\"\",IFERROR(VLOOKUP(T5,ZCO_BZDD!$B$2:$D$645,3,),\"Y\"))","v":""}]
[3,{"$f":"EDATE($B$2,3)","v":"2025-07-08"},{"$f":"IFERROR(VLOOKUP(B6,ZCO_BZDD!$B:$D,3,),\"Y\")","v":"Y"},{"$f":"IF(C6=\"Y\",\"\",B6+1)","v":""},{"$f":"IF(D6=\"\",\"\",IFERROR(VLOOKUP(D6,ZCO_BZDD!$B$2:$D$645,3,),\"Y\"))","v":""},"",{"$f":"IF(F6=\"\",\"\",IFERROR(VLOOKUP(F6,ZCO_BZDD!$B$2:$D$645,3,),\"Y\"))","v":""},"",{"$f":"IF(H6=\"\",\"\",IFERROR(VLOOKUP(H6,ZCO_BZDD!$B$2:$D$645,3,),\"Y\"))","v":""},"",{"$f":"IF(J6=\"\",\"\",IFERROR(VLOOKUP(J6,ZCO_BZDD!$B$2:$D$645,3,),\"Y\"))","v":""},"",{"$f":"IF(L6=\"\",\"\",IFERROR(VLOOKUP(L6,ZCO_BZDD!$B$2:$D$645,3,),\"Y\"))","v":""},"",{"$f":"IF(N6=\"\",\"\",IFERROR(VLOOKUP(N6,ZCO_BZDD!$B$2:$D$645,3,),\"Y\"))","v":""},"",{"$f":"IF(P6=\"\",\"\",IFERROR(VLOOKUP(P6,ZCO_BZDD!$B$2:$D$645,3,),\"Y\"))","v":""},"",{"$f":"IF(R6=\"\",\"\",IFERROR(VLOOKUP(R6,ZCO_BZDD!$B$2:$D$645,3,),\"Y\"))","v":""},"",{"$f":"IF(T6=\"\",\"\",IFERROR(VLOOKUP(T6,ZCO_BZDD!$B$2:$D$645,3,),\"Y\"))","v":""}]
[4,{"$f":"EDATE($B$2,4)","v":"2025-08-08"},{"$f":"IFERROR(VLOOKUP(B7,ZCO_BZDD!$B:$D,3,),\"Y\")","v":"Y"},{"$f":"IF(C7=\"Y\",\"\",B7+1)","v":""},{"$f":"IF(D7=\"\",\"\",IFERROR(VLOOKUP(D7,ZCO_BZDD!$B$2:$D$645,3,),\"Y\"))","v":""},"",{"$f":"IF(F7=\"\",\"\",IFERROR(VLOOKUP(F7,ZCO_BZDD!$B$2:$D$645,3,),\"Y\"))","v":""},"",{"$f":"IF(H7=\"\",\"\",IFERROR(VLOOKUP(H7,ZCO_BZDD!$B$2:$D$645,3,),\"Y\"))","v":""},"",{"$f":"IF(J7=\"\",\"\",IFERROR(VLOOKUP(J7,ZCO_BZDD!$B$2:$D$645,3,),\"Y\"))","v":""},"",{"$f":"IF(L7=\"\",\"\",IFERROR(VLOOKUP(L7,ZCO_BZDD!$B$2:$D$645,3,),\"Y\"))","v":""},"",{"$f":"IF(N7=\"\",\"\",IFERROR(VLOOKUP(N7,ZCO_BZDD!$B$2:$D$645,3,),\"Y\"))","v":""},"",{"$f":"IF(P7=\"\",\"\",IFERROR(VLOOKUP(P7,ZCO_BZDD!$B$2:$D$645,3,),\"Y\"))","v":""},"",{"$f":"IF(R7=\"\",\"\",IFERROR(VLOOKUP(R7,ZCO_BZDD!$B$2:$D$645,3,),\"Y\"))","v":""},"",{"$f":"IF(T7=\"\",\"\",IFERROR(VLOOKUP(T7,ZCO_BZDD!$B$2:$D$645,3,),\"Y\"))","v":""}]
[5,{"$f":"EDATE($B$2,5)","v":"2025-09-08"},{"$f":"IFERROR(VLOOKUP(B8,ZCO_BZDD!$B:$D,3,),\"Y\")","v":"Y"},"",{"$f":"IF(D8=\"\",\"\",IFERROR(VLOOKUP(D8,ZCO_BZDD!$B$2:$D$645,3,),\"Y\"))","v":""},"",{"$f":"IF(F8=\"\",\"\",IFERROR(VLOOKUP(F8,ZCO_BZDD!$B$2:$D$645,3,),\"Y\"))","v":""},"",{"$f":"IF(H8=\"\",\"\",IFERROR(VLOOKUP(H8,ZCO_BZDD!$B$2:$D$645,3,),\"Y\"))","v":""},"",{"$f":"IF(J8=\"\",\"\",IFERROR(VLOOKUP(J8,ZCO_BZDD!$B$2:$D$645,3,),\"Y\"))","v":""},"",{"$f":"IF(L8=\"\",\"\",IFERROR(VLOOKUP(L8,ZCO_BZDD!$B$2:$D$645,3,),\"Y\"))","v":""},"",{"$f":"IF(N8=\"\",\"\",IFERROR(VLOOKUP(N8,ZCO_BZDD!$B$2:$D$645,3,),\"Y\"))","v":""},"",{"$f":"IF(P8=\"\",\"\",IFERROR(VLOOKUP(P8,ZCO_BZDD!$B$2:$D$645,3,),\"Y\"))","v":""},"",{"$f":"IF(R8=\"\",\"\",IFERROR(VLOOKUP(R8,ZCO_BZDD!$B$2:$D$645,3,),\"Y\"))","v":""},"",{"$f":"IF(T8=\"\",\"\",IFERROR(VLOOKUP(T8,ZCO_BZDD!$B$2:$D$645,3,),\"Y\"))","v":""}]
[6,{"$f":"EDATE($B$2,6)","v":"2025-10-08"},{"$f":"IFERROR(VLOOKUP(B9,ZCO_BZDD!$B:$D,3,),\"Y\")","v":"N"},"2025-10-09",{"$f":"IF(D9=\"\",\"\",IFERROR(VLOOKUP(D9,ZCO_BZDD!$B$2:$D$645,3,),\"Y\"))","v":"N"},"2025-10-10",{"$f":"IF(F9=\"\",\"\",IFERROR(VLOOKUP(F9,ZCO_BZDD!$B$2:$D$645,3,),\"Y\"))","v":"Y"},"",{"$f":"IF(H9=\"\",\"\",IFERROR(VLOOKUP(H9,ZCO_BZDD!$B$2:$D$645,3,),\"Y\"))","v":""},"",{"$f":"IF(J9=\"\",\"\",IFERROR(VLOOKUP(J9,ZCO_BZDD!$B$2:$D$645,3,),\"Y\"))","v":""},"",{"$f":"IF(L9=\"\",\"\",IFERROR(VLOOKUP(L9,ZCO_BZDD!$B$2:$D$645,3,),\"Y\"))","v":""},"",{"$f":"IF(N9=\"\",\"\",IFERROR(VLOOKUP(N9,ZCO_BZDD!$B$2:$D$645,3,),\"Y\"))","v":""},"",{"$f":"IF(P9=\"\",\"\",IFERROR(VLOOKUP(P9,ZCO_BZDD!$B$2:$D$645,3,),\"Y\"))","v":""},"",{"$f":"IF(R9=\"\",\"\",IFERROR(VLOOKUP(R9,ZCO_BZDD!$B$2:$D$645,3,),\"Y\"))","v":""},"",{"$f":"IF(T9=\"\",\"\",IFERROR(VLOOKUP(T9,ZCO_BZDD!$B$2:$D$645,3,),\"Y\"))","v":""}]
[7,{"$f":"EDATE($B$2,7)","v":"2025-11-08"},{"$f":"IFERROR(VLOOKUP(B10,ZCO_BZDD!$B:$D,3,),\"Y\")","v":"N"},"2025-11-09",{"$f":"IF(D10=\"\",\"\",IFERROR(VLOOKUP(D10,ZCO_BZDD!$B$2:$D$645,3,),\"Y\"))","v":"N"},"2025-11-10",{"$f":"IF(F10=\"\",\"\",IFERROR(VLOOKUP(F10,ZCO_BZDD!$B$2:$D$645,3,),\"Y\"))","v":"Y"},"",{"$f":"IF(H10=\"\",\"\",IFERROR(VLOOKUP(H10,ZCO_BZDD!$B$2:$D$645,3,),\"Y\"))","v":""},"",{"$f":"IF(J10=\"\",\"\",IFERROR(VLOOKUP(J10,ZCO_BZDD!$B$2:$D$645,3,),\"Y\"))","v":""},"",{"$f":"IF(L10=\"\",\"\",IFERROR(VLOOKUP(L10,ZCO_BZDD!$B$2:$D$645,3,),\"Y\"))","v":""},"",{"$f":"IF(N10=\"\",\"\",IFERROR(VLOOKUP(N10,ZCO_BZDD!$B$2:$D$645,3,),\"Y\"))","v":""},"",{"$f":"IF(P10=\"\",\"\",IFERROR(VLOOKUP(P10,ZCO_BZDD!$B$2:$D$645,3,),\"Y\"))","v":""},"",{"$f":"IF(R10=\"\",\"\",IFERROR(VLOOKUP(R10,ZCO_BZDD!$B$2:$D$645,3,),\"Y\"))","v":""},"",{"$f":"IF(T10=\"\",\"\",IFERROR(VLOOKUP(T10,ZCO_BZDD!$B$2:$D$645,3,),\"Y\"))","v":""}]
[8,{"$f":"EDATE($B$2,8)","v":"2025-12-08"},{"$f":"IFERROR(VLOOKUP(B11,ZCO_BZDD!$B:$D,3,),\"Y\")","v":"Y"},"",{"$f":"IF(D11=\"\",\"\",IFERROR(VLOOKUP(D11,ZCO_BZDD!$B$2:$D$645,3,),\"Y\"))","v":""},"",{"$f":"IF(F11=\"\",\"\",IFERROR(VLOOKUP(F11,ZCO_BZDD!$B$2:$D$645,3,),\"Y\"))","v":""},"",{"$f":"IF(H11=\"\",\"\",IFERROR(VLOOKUP(H11,ZCO_BZDD!$B$2:$D$645,3,),\"Y\"))","v":""},"",{"$f":"IF(J11=\"\",\"\",IFERROR(VLOOKUP(J11,ZCO_BZDD!$B$2:$D$645,3,),\"Y\"))","v":""},"",{"$f":"IF(L11=\"\",\"\",IFERROR(VLOOKUP(L11,ZCO_BZDD!$B$2:$D$645,3,),\"Y\"))","v":""},"",{"$f":"IF(N11=\"\",\"\",IFERROR(VLOOKUP(N11,ZCO_BZDD!$B$2:$D$645,3,),\"Y\"))","v":""},"",{"$f":"IF(P11=\"\",\"\",IFERROR(VLOOKUP(P11,ZCO_BZDD!$B$2:$D$645,3,),\"Y\"))","v":""},"",{"$f":"IF(R11=\"\",\"\",IFERROR(VLOOKUP(R11,ZCO_BZDD!$B$2:$D$645,3,),\"Y\"))","v":""},"",{"$f":"IF(T11=\"\",\"\",IFERROR(VLOOKUP(T11,ZCO_BZDD!$B$2:$D$645,3,),\"Y\"))","v":""}]
[9,{"$f":"EDATE($B$2,9)","v":"2026-01-08"},{"$f":"IFERROR(VLOOKUP(B12,ZCO_BZDD!$B:$D,3,),\"Y\")","v":"Y"},"",{"$f":"IF(D12=\"\",\"\",IFERROR(VLOOKUP(D12,ZCO_BZDD!$B$2:$D$645,3,),\"Y\"))","v":""},"",{"$f":"IF(F12=\"\",\"\",IFERROR(VLOOKUP(F12,ZCO_BZDD!$B$2:$D$645,3,),\"Y\"))","v":""},"",{"$f":"IF(H12=\"\",\"\",IFERROR(VLOOKUP(H12,ZCO_BZDD!$B$2:$D$645,3,),\"Y\"))","v":""},"",{"$f":"IF(J12=\"\",\"\",IFERROR(VLOOKUP(J12,ZCO_BZDD!$B$2:$D$645,3,),\"Y\"))","v":""},"",{"$f":"IF(L12=\"\",\"\",IFERROR(VLOOKUP(L12,ZCO_BZDD!$B$2:$D$645,3,),\"Y\"))","v":""},"",{"$f":"IF(N12=\"\",\"\",IFERROR(VLOOKUP(N12,ZCO_BZDD!$B$2:$D$645,3,),\"Y\"))","v":""},"",{"$f":"IF(P12=\"\",\"\",IFERROR(VLOOKUP(P12,ZCO_BZDD!$B$2:$D$645,3,),\"Y\"))","v":""},"",{"$f":"IF(R12=\"\",\"\",IFERROR(VLOOKUP(R12,ZCO_BZDD!$B$2:$D$645,3,),\"Y\"))","v":""},"",{"$f":"IF(T12=\"\",\"\",IFERROR(VLOOKUP(T12,ZCO_BZDD!$B$2:$D$645,3,),\"Y\"))","v":""}]
[10,{"$f":"EDATE($B$2,10)","v":"2026-02-08"},{"$f":"IFERROR(VLOOKUP(B13,ZCO_BZDD!$B:$D,3,),\"Y\")","v":"N"},"2026-02-09",{"$f":"IF(D13=\"\",\"\",IFERROR(VLOOKUP(D13,ZCO_BZDD!$B$2:$D$645,3,),\"Y\"))","v":"Y"},"",{"$f":"IF(F13=\"\",\"\",IFERROR(VLOOKUP(F13,ZCO_BZDD!$B$2:$D$645,3,),\"Y\"))","v":""},"",{"$f":"IF(H13=\"\",\"\",IFERROR(VLOOKUP(H13,ZCO_BZDD!$B$2:$D$645,3,),\"Y\"))","v":""},"",{"$f":"IF(J13=\"\",\"\",IFERROR(VLOOKUP(J13,ZCO_BZDD!$B$2:$D$645,3,),\"Y\"))","v":""},"",{"$f":"IF(L13=\"\",\"\",IFERROR(VLOOKUP(L13,ZCO_BZDD!$B$2:$D$645,3,),\"Y\"))","v":""},"",{"$f":"IF(N13=\"\",\"\",IFERROR(VLOOKUP(N13,ZCO_BZDD!$B$2:$D$645,3,),\"Y\"))","v":""},"",{"$f":"IF(P13=\"\",\"\",IFERROR(VLOOKUP(P13,ZCO_BZDD!$B$2:$D$645,3,),\"Y\"))","v":""},"",{"$f":"IF(R13=\"\",\"\",IFERROR(VLOOKUP(R13,ZCO_BZDD!$B$2:$D$645,3,),\"Y\"))","v":""},"",{"$f":"IF(T13=\"\",\"\",IFERROR(VLOOKUP(T13,ZCO_BZDD!$B$2:$D$645,3,),\"Y\"))","v":""}]
[11,{"$f":"EDATE($B$2,11)","v":"2026-03-08"},{"$f":"IFERROR(VLOOKUP(B14,ZCO_BZDD!$B:$D,3,),\"Y\")","v":"N"},"2026-03-09",{"$f":"IF(D14=\"\",\"\",IFERROR(VLOOKUP(D14,ZCO_BZDD!$B$2:$D$645,3,),\"Y\"))","v":"Y"},"",{"$f":"IF(F14=\"\",\"\",IFERROR(VLOOKUP(F14,ZCO_BZDD!$B$2:$D$645,3,),\"Y\"))","v":""},"",{"$f":"IF(H14=\"\",\"\",IFERROR(VLOOKUP(H14,ZCO_BZDD!$B$2:$D$645,3,),\"Y\"))","v":""},"",{"$f":"IF(J14=\"\",\"\",IFERROR(VLOOKUP(J14,ZCO_BZDD!$B$2:$D$645,3,),\"Y\"))","v":""},"",{"$f":"IF(L14=\"\",\"\",IFERROR(VLOOKUP(L14,ZCO_BZDD!$B$2:$D$645,3,),\"Y\"))","v":""},"",{"$f":"IF(N14=\"\",\"\",IFERROR(VLOOKUP(N14,ZCO_BZDD!$B$2:$D$645,3,),\"Y\"))","v":""},"",{"$f":"IF(P14=\"\",\"\",IFERROR(VLOOKUP(P14,ZCO_BZDD!$B$2:$D$645,3,),\"Y\"))","v":""},"",{"$f":"IF(R14=\"\",\"\",IFERROR(VLOOKUP(R14,ZCO_BZDD!$B$2:$D$645,3,),\"Y\"))","v":""},"",{"$f":"IF(T14=\"\",\"\",IFERROR(VLOOKUP(T14,ZCO_BZDD!$B$2:$D$645,3,),\"Y\"))","v":""}]
[12,{"$f":"EDATE($B$2,12)-1","v":"2026-04-07"},{"$f":"IFERROR(VLOOKUP(B15,ZCO_BZDD!$B:$D,3,),\"Y\")","v":"Y"},{"$f":"IF(C15=\"Y\",\"\",B15-1)","v":""},{"$f":"IF(D15=\"\",\"\",IFERROR(VLOOKUP(D15,ZCO_BZDD!$B$2:$D$645,3,),\"Y\"))","v":""},{"$f":"IFERROR(IF(E15=\"Y\",\"\",D15-1),\"\")","v":""},{"$f":"IF(F15=\"\",\"\",IFERROR(VLOOKUP(F15,ZCO_BZDD!$B$2:$D$645,3,),\"Y\"))","v":""},{"$f":"IFERROR(IF(G15=\"Y\",\"\",F15-1),\"\")","v":""},{"$f":"IF(H15=\"\",\"\",IFERROR(VLOOKUP(H15,ZCO_BZDD!$B$2:$D$645,3,),\"Y\"))","v":""},{"$f":"IFERROR(IF(I15=\"Y\",\"\",H15-1),\"\")","v":""},{"$f":"IF(J15=\"\",\"\",IFERROR(VLOOKUP(J15,ZCO_BZDD!$B$2:$D$645,3,),\"Y\"))","v":""},{"$f":"IFERROR(IF(K15=\"Y\",\"\",J15-1),\"\")","v":""},{"$f":"IF(L15=\"\",\"\",IFERROR(VLOOKUP(L15,ZCO_BZDD!$B$2:$D$645,3,),\"Y\"))","v":""},{"$f":"IFERROR(IF(M15=\"Y\",\"\",L15-1),\"\")","v":""},{"$f":"IF(N15=\"\",\"\",IFERROR(VLOOKUP(N15,ZCO_BZDD!$B$2:$D$645,3,),\"Y\"))","v":""},{"$f":"IFERROR(IF(O15=\"Y\",\"\",N15-1),\"\")","v":""},{"$f":"IF(P15=\"\",\"\",IFERROR(VLOOKUP(P15,ZCO_BZDD!$B$2:$D$645,3,),\"Y\"))","v":""},{"$f":"IFERROR(IF(Q15=\"Y\",\"\",P15-1),\"\")","v":""},{"$f":"IF(R15=\"\",\"\",IFERROR(VLOOKUP(R15,ZCO_BZDD!$B$2:$D$645,3,),\"Y\"))","v":""},{"$f":"IFERROR(IF(S15=\"Y\",\"\",R15-1),\"\")","v":""},{"$f":"IF(T15=\"\",\"\",IFERROR(VLOOKUP(T15,ZCO_BZDD!$B$2:$D$645,3,),\"Y\"))","v":""}]
[]
["회차","최종일자"]
[1,{"$f":"MAX(B4:U4)","v":"2025-05-08"}]
[2,"2025-06-09"]
[3,"2025-07-08"]
[4,"2025-08-08"]
[5,"2025-09-08"]
[6,"2025-10-10"]
[7,"2025-11-10"]
[8,"2025-12-08"]
[9,"2026-01-08"]
[10,"2026-02-09"]
[11,"2026-03-09"]
[12,{"$f":"MIN(B15:U15)","v":"2026-04-07"}]

{"sheet":"상환금","index":3,"n_rows":17,"n_cols":4,"rows_kept":17,"cut":false,"hidden":true,"merged":[]}
[]
["승인회차",{"$f":"분할상환계획표!E11","v":12}]
[]
["신청금액",{"$f":"분할상환계획표!E7","v":0},{"$f":"($B$2-1)*$B$6","v":0},{"$f":"B4-C4","v":0}]
[]
[1,{"$f":"IFERROR(ROUNDDOWN(IF($B$2>$A6,$B$4/$B$2,IF($B$2=$A6,$B$4-$C$4,\"\")),-1),\"\")","v":0}]
[2,{"$f":"IFERROR(ROUNDDOWN(IF($B$2>$A7,$B$4/$B$2,IF($B$2=$A7,$B$4-$C$4,\"\")),-1),\"\")","v":0}]
[3,0]
[4,0]
[5,0]
[6,0]
[7,0]
[8,0]
[9,0]
[10,0]
[11,0]
[12,0]